Tuesday, 11-Mar-2014 10:53:48 GMT

Web browsers on FreeBSD ia64

This page is about the (sorry) state of web browsers available on FreeBSD ia64 via ports.

Contact me (mexas@bris.ac.uk) with any questions or comments.

Browsers which build

  1. netsurf - works, but no javascript
  2. rekonq - segfault
  3. konqueror - segfault
  4. epiphany - segfault - webkit-gtk problems
  5. midori - segfault - webkit-gtk problems
  6. surf - segfault - webkit-gtk problems
  7. xxxterm - segfault - webkit-gtk problems
  8. dillo - segfault
  9. arora - segfault

GDB segfaults while analysing some coredumps. Here's the bug report: 13877 .

Browsers which don't even build

  1. firefox - multiple build errors
  2. seamonkey - build error
  3. www/kazehakase - libxul doesn't build
  4. www/xpi-conkeror - libxul doesn't build
  5. www/w3m 0.5.3 - devel/boehm-gc doesn't build
  6. opera - i386 and amd64 only
  7. chromium - i386 and amd64 only

midori

Version        : 0.4.4
Origin         : www/midori

Seems epiphany, midori, surf, xxxterm all indicate a problem with webkit.

% midori 
bind: Address already in use

(midori4:12405): Gtk-WARNING **: Error loading theme icon 'gnome-stock-trash' for stock: Icon 'gnome-stock-trash' not present in theme
ASSERTION FAILED: isPageAligned(size)
./Source/JavaScriptCore/wtf/PageAllocation.h(101) : static WTF::PageAllocation WTF::PageAllocation::allocate(size_t, WTF::OSAllocator::Usage, bool, bool)
Segmentation fault (core dumped)
%

% gdb /usr/local/bin/midori midori.core
GNU gdb 6.1.1 [FreeBSD]
Copyright 2004 Free Software Foundation, Inc.
GDB is free software, covered by the GNU General Public License, and you are
welcome to change it and/or distribute copies of it under certain conditions.
Type "show copying" to see the conditions.
There is absolutely no warranty for GDB.  Type "show warranty" for details.
This GDB was configured as "ia64-marcel-freebsd"...
Core was generated by `midori'.
Program terminated with signal 11, Segmentation fault.
Reading symbols from /usr/local/lib/libgobject-2.0.so.0...done.
Loaded symbols for /usr/local/lib/libgobject-2.0.so.0
Reading symbols from /usr/local/lib/libgthread-2.0.so.0...done.
Loaded symbols for /usr/local/lib/libgthread-2.0.so.0
Reading symbols from /usr/local/lib/libglib-2.0.so.0...done.
Loaded symbols for /usr/local/lib/libglib-2.0.so.0
Reading symbols from /lib/libm.so.5...done.
Loaded symbols for /lib/libm.so.5
Reading symbols from /usr/local/lib/libsoup-2.4.so.1...done.
Loaded symbols for /usr/local/lib/libsoup-2.4.so.1
Reading symbols from /usr/local/lib/libgio-2.0.so.0...done.
Loaded symbols for /usr/local/lib/libgio-2.0.so.0
Reading symbols from /usr/local/lib/libgmodule-2.0.so.0...done.
Loaded symbols for /usr/local/lib/libgmodule-2.0.so.0
Reading symbols from /usr/local/lib/libgtk-x11-2.0.so.0...done.
Loaded symbols for /usr/local/lib/libgtk-x11-2.0.so.0
Reading symbols from /usr/local/lib/libgdk-x11-2.0.so.0...done.
Loaded symbols for /usr/local/lib/libgdk-x11-2.0.so.0
Reading symbols from /usr/local/lib/libatk-1.0.so.0...done.
Loaded symbols for /usr/local/lib/libatk-1.0.so.0
Reading symbols from /usr/local/lib/libpangocairo-1.0.so.0...done.
Loaded symbols for /usr/local/lib/libpangocairo-1.0.so.0
Reading symbols from /usr/local/lib/libXext.so.6...done.
Loaded symbols for /usr/local/lib/libXext.so.6
Reading symbols from /usr/local/lib/libXrender.so.1...done.
Loaded symbols for /usr/local/lib/libXrender.so.1
Reading symbols from /usr/local/lib/libXinerama.so.1...done.
Loaded symbols for /usr/local/lib/libXinerama.so.1
Reading symbols from /usr/local/lib/libXi.so.6...done.
Loaded symbols for /usr/local/lib/libXi.so.6
Reading symbols from /usr/local/lib/libXrandr.so.2...done.
Loaded symbols for /usr/local/lib/libXrandr.so.2
Reading symbols from /usr/local/lib/libXcursor.so.1...done.
Loaded symbols for /usr/local/lib/libXcursor.so.1
Reading symbols from /usr/local/lib/libXcomposite.so.1...done.
Loaded symbols for /usr/local/lib/libXcomposite.so.1
Reading symbols from /usr/local/lib/libXdamage.so.1...done.
Loaded symbols for /usr/local/lib/libXdamage.so.1
Reading symbols from /usr/local/lib/libgdk_pixbuf-2.0.so.0...done.
Loaded symbols for /usr/local/lib/libgdk_pixbuf-2.0.so.0
Reading symbols from /usr/local/lib/libpangoft2-1.0.so.0...done.
Loaded symbols for /usr/local/lib/libpangoft2-1.0.so.0
Reading symbols from /usr/local/lib/libXfixes.so.3...done.
Loaded symbols for /usr/local/lib/libXfixes.so.3
Reading symbols from /usr/local/lib/libcairo.so.2...done.
Loaded symbols for /usr/local/lib/libcairo.so.2
Reading symbols from /usr/local/lib/libX11.so.6...done.
Loaded symbols for /usr/local/lib/libX11.so.6
Reading symbols from /usr/local/lib/libpango-1.0.so.0...done.
Loaded symbols for /usr/local/lib/libpango-1.0.so.0
Reading symbols from /usr/local/lib/libfreetype.so.9...done.
Loaded symbols for /usr/local/lib/libfreetype.so.9
Reading symbols from /usr/local/lib/libfontconfig.so.1...done.
Loaded symbols for /usr/local/lib/libfontconfig.so.1
Reading symbols from /usr/local/lib/libsqlite3.so.8...done.
Loaded symbols for /usr/local/lib/libsqlite3.so.8
Reading symbols from /usr/local/lib/libnotify.so.4...done.
Loaded symbols for /usr/local/lib/libnotify.so.4
Reading symbols from /usr/local/lib/libwebkitgtk-1.0.so.0...Segmentation fault (core dumped)
%
 

top

konqueror

Version        : 4.7.4_1
Origin         : x11/kde4-baseapps

Bug reports: 296433. Note that konqueror and rekonq seem to segfault with the same backtrace.

% konqueror 
Segmentation fault (core dumped)

% gdb /usr/local/kde4/bin/konqueror konqueror.core
GNU gdb 6.1.1 [FreeBSD]
Copyright 2004 Free Software Foundation, Inc.
GDB is free software, covered by the GNU General Public License, and you are
welcome to change it and/or distribute copies of it under certain conditions.
Type "show copying" to see the conditions.
There is absolutely no warranty for GDB.  Type "show warranty" for details.
This GDB was configured as "ia64-marcel-freebsd"...(no debugging symbols found)...
Core was generated by `konqueror'.
Program terminated with signal 11, Segmentation fault.
Reading symbols from /usr/local/kde4/lib/libkdeinit4_konqueror.so...(no debugging symbols founddone.
Loaded symbols for /usr/local/kde4/lib/libkdeinit4_konqueror.so
Reading symbols from /usr/local/kde4/lib/libkonquerorprivate.so.5...(no debugging symbols founddone.
Loaded symbols for /usr/local/kde4/lib/libkonquerorprivate.so.5
Reading symbols from /usr/local/kde4/lib/libkonq.so.7...(no debugging symbols found)...done.
Loaded symbols for /usr/local/kde4/lib/libkonq.so.7
Reading symbols from /usr/local/kde4/lib/libkparts.so.5...(no debugging symbols found)...done.
Loaded symbols for /usr/local/kde4/lib/libkparts.so.5
Reading symbols from /usr/local/kde4/lib/libkcmutils.so.5...(no debugging symbols found)...done
Loaded symbols for /usr/local/kde4/lib/libkcmutils.so.5
Reading symbols from /usr/local/kde4/lib/libkfile.so.5...(no debugging symbols found)...done.
Loaded symbols for /usr/local/kde4/lib/libkfile.so.5
Reading symbols from /usr/local/kde4/lib/libkio.so.7...(no debugging symbols found)...done.
Loaded symbols for /usr/local/kde4/lib/libkio.so.7
Reading symbols from /usr/local/kde4/lib/libnepomukutils.so.5...(no debugging symbols found)....
Loaded symbols for /usr/local/kde4/lib/libnepomukutils.so.5
Reading symbols from /usr/local/lib/qt4/libQtNetwork.so.4...done.
Loaded symbols for /usr/local/lib/qt4/libQtNetwork.so.4
Reading symbols from /usr/local/lib/qt4/libQtXml.so.4...done.
Loaded symbols for /usr/local/lib/qt4/libQtXml.so.4
Reading symbols from /usr/local/kde4/lib/libnepomuk.so.5...done.
Loaded symbols for /usr/local/kde4/lib/libnepomuk.so.5
Reading symbols from /usr/local/lib/libsoprano.so.4...done.
Loaded symbols for /usr/local/lib/libsoprano.so.4
Reading symbols from /usr/local/kde4/lib/libkdeui.so.7...done.
Loaded symbols for /usr/local/kde4/lib/libkdeui.so.7
Reading symbols from /usr/local/lib/qt4/libQtSvg.so.4...done.
Loaded symbols for /usr/local/lib/qt4/libQtSvg.so.4
Reading symbols from /usr/local/kde4/lib/libkdecore.so.7...done.
Loaded symbols for /usr/local/kde4/lib/libkdecore.so.7
Reading symbols from /usr/local/lib/qt4/libQtCore.so.4...done.
Loaded symbols for /usr/local/lib/qt4/libQtCore.so.4
Reading symbols from /usr/local/lib/qt4/libQtDBus.so.4...done.
Loaded symbols for /usr/local/lib/qt4/libQtDBus.so.4
Reading symbols from /usr/local/lib/qt4/libQtGui.so.4...done.
Loaded symbols for /usr/local/lib/qt4/libQtGui.so.4
Reading symbols from /usr/local/lib/libSM.so.6...done.
Loaded symbols for /usr/local/lib/libSM.so.6
Reading symbols from /usr/local/lib/libICE.so.6...done.
Loaded symbols for /usr/local/lib/libICE.so.6
Reading symbols from /usr/local/lib/libX11.so.6...done.
Loaded symbols for /usr/local/lib/libX11.so.6
Reading symbols from /usr/local/lib/libXext.so.6...done.
Loaded symbols for /usr/local/lib/libXext.so.6
Reading symbols from /usr/local/lib/libXft.so.2...done.
Loaded symbols for /usr/local/lib/libXft.so.2
Reading symbols from /usr/local/lib/libXau.so.6...done.
Loaded symbols for /usr/local/lib/libXau.so.6
Reading symbols from /usr/local/lib/libXdmcp.so.6...done.
Loaded symbols for /usr/local/lib/libXdmcp.so.6
Reading symbols from /usr/local/lib/libXpm.so.4...done.
Loaded symbols for /usr/local/lib/libXpm.so.4
Reading symbols from /usr/lib/libstdc++.so.6...done.
Loaded symbols for /usr/lib/libstdc++.so.6
Reading symbols from /lib/libm.so.5...done.
Loaded symbols for /lib/libm.so.5
Reading symbols from /lib/libgcc_s.so.1...done.
Loaded symbols for /lib/libgcc_s.so.1
Reading symbols from /lib/libthr.so.3...done.
Loaded symbols for /lib/libthr.so.3
Reading symbols from /lib/libc.so.7...done.
Loaded symbols for /lib/libc.so.7
Reading symbols from /lib/libz.so.6...done.
Loaded symbols for /lib/libz.so.6
Reading symbols from /usr/local/kde4/lib/libsolid.so.5...done.
Loaded symbols for /usr/local/kde4/lib/libsolid.so.5
Reading symbols from /usr/local/lib/libXrender.so.1...done.
Loaded symbols for /usr/local/lib/libXrender.so.1
Reading symbols from /usr/local/kde4/lib/libnepomukquery.so.5...done.
Loaded symbols for /usr/local/kde4/lib/libnepomukquery.so.5
Reading symbols from /usr/local/lib/libstreamanalyzer.so.0...done.
Loaded symbols for /usr/local/lib/libstreamanalyzer.so.0
Reading symbols from /usr/local/lib/libstreams.so.0...done.
Loaded symbols for /usr/local/lib/libstreams.so.0
Reading symbols from /usr/local/lib/libsopranoclient.so.1...done.
Loaded symbols for /usr/local/lib/libsopranoclient.so.1
Reading symbols from /usr/local/lib/libqca.so.2...done.
Loaded symbols for /usr/local/lib/libqca.so.2
Reading symbols from /usr/local/lib/libattica.so.0...done.
Loaded symbols for /usr/local/lib/libattica.so.0
Reading symbols from /usr/local/lib/libdbusmenu-qt.so.2...done.
Loaded symbols for /usr/local/lib/libdbusmenu-qt.so.2
Reading symbols from /usr/local/lib/libXtst.so.6...done.
Loaded symbols for /usr/local/lib/libXtst.so.6
Reading symbols from /usr/local/lib/libXcursor.so.1...done.
Loaded symbols for /usr/local/lib/libXcursor.so.1
Reading symbols from /usr/local/lib/libXfixes.so.3...done.
Loaded symbols for /usr/local/lib/libXfixes.so.3
Reading symbols from /usr/lib/libbz2.so.4...done.
Loaded symbols for /usr/lib/libbz2.so.4
Reading symbols from /usr/lib/liblzma.so.5...done.
Loaded symbols for /usr/lib/liblzma.so.5
Reading symbols from /usr/local/lib/libintl.so.9...done.
Loaded symbols for /usr/local/lib/libintl.so.9
Reading symbols from /usr/local/lib/libfam.so.0...done.
Loaded symbols for /usr/local/lib/libfam.so.0
Reading symbols from /usr/local/lib/libgthread-2.0.so.0...done.
Loaded symbols for /usr/local/lib/libgthread-2.0.so.0
Reading symbols from /usr/local/lib/libglib-2.0.so.0...done.
Loaded symbols for /usr/local/lib/libglib-2.0.so.0
Reading symbols from /usr/local/lib/libiconv.so.3...done.
Loaded symbols for /usr/local/lib/libiconv.so.3
Reading symbols from /usr/local/lib/libpng.so.6...done.
Loaded symbols for /usr/local/lib/libpng.so.6
Reading symbols from /usr/local/lib/libfreetype.so.9...done.
Loaded symbols for /usr/local/lib/libfreetype.so.9
Reading symbols from /usr/local/lib/libfontconfig.so.1...done.
Loaded symbols for /usr/local/lib/libfontconfig.so.1
Reading symbols from /usr/local/lib/libxcb.so.2...done.
Loaded symbols for /usr/local/lib/libxcb.so.2
Reading symbols from /usr/local/lib/libpthread-stubs.so.0...done.
Loaded symbols for /usr/local/lib/libpthread-stubs.so.0
Reading symbols from /usr/lib/librpcsvc.so.5...done.
Loaded symbols for /usr/lib/librpcsvc.so.5
Reading symbols from /usr/local/lib/libHUpnp.so.1...done.
Loaded symbols for /usr/local/lib/libHUpnp.so.1
Reading symbols from /usr/local/lib/libxml2.so.5...done.
Loaded symbols for /usr/local/lib/libxml2.so.5
Reading symbols from /usr/local/lib/libXi.so.6...done.
Loaded symbols for /usr/local/lib/libXi.so.6
Reading symbols from /usr/local/lib/libicui18n.so.48...done.
Loaded symbols for /usr/local/lib/libicui18n.so.48
Reading symbols from /usr/local/lib/libpcre.so.1...done.
Loaded symbols for /usr/local/lib/libpcre.so.1
Reading symbols from /usr/local/lib/libexpat.so.6...done.
Loaded symbols for /usr/local/lib/libexpat.so.6
Reading symbols from /usr/local/lib/libQtSolutions_SOAP-2.7.so.1...done.
Loaded symbols for /usr/local/lib/libQtSolutions_SOAP-2.7.so.1
Reading symbols from /usr/local/lib/libicuuc.so.48...done.
Loaded symbols for /usr/local/lib/libicuuc.so.48
Reading symbols from /usr/local/lib/libicudata.so.48...done.
Loaded symbols for /usr/local/lib/libicudata.so.48
Reading symbols from /usr/local/lib/libXrandr.so.2...done.
Loaded symbols for /usr/local/lib/libXrandr.so.2
Reading symbols from /usr/local/lib/libXinerama.so.1...done.
Loaded symbols for /usr/local/lib/libXinerama.so.1
Reading symbols from /libexec/ld-elf.so.1...done.
Loaded symbols for /libexec/ld-elf.so.1
#0  0x0000000122892931 in KSharedDataCache::find () from /usr/local/kde4/lib/libkdecore.so.7
[New Thread 128404400 (LWP 100111/konqueror)]
(gdb) bt
#0  0x0000000122892931 in KSharedDataCache::find () from /usr/local/kde4/lib/libkdecore.so.7
#1  0x0000000121a0a350 in KIconLoader::~KIconLoader () from /usr/local/kde4/lib/libkdeui.so.7
#2  0x0000000000000000 in ?? ()
Previous frame identical to this frame (corrupt stack?)
(gdb) 

top

webkit-gtk2

Version        : 1.4.3
Origin         : www/webkit-gtk2

Bug reports: 81527

Builds, but seems to cause segfault for browsers depending on it: midori, epiphany, surf, xxxterm

top

surf

Version        : 0.4.1_1
Origin         : www/surf

Seems epiphany, midori, surf, xxxterm all indicate a problem with webkit.

% surf bris.ac.uk

(unknown:34992): libsoup-WARNING **: No feature manager for feature of type 'SoupCookie'
ASSERTION FAILED: isPageAligned(size)
./Source/JavaScriptCore/wtf/PageAllocation.h(101) : static WTF::PageAllocation WTF::PageAllocation::allocate(size_t, WTF::OSAllocator::Usage, bool, bool)
Segmentation fault (core dumped)

% gdb /usr/local/bin/surf surf.core 
GNU gdb 6.1.1 [FreeBSD]
Copyright 2004 Free Software Foundation, Inc.
GDB is free software, covered by the GNU General Public License, and you are
welcome to change it and/or distribute copies of it under certain conditions.
Type "show copying" to see the conditions.
There is absolutely no warranty for GDB.  Type "show warranty" for details.
This GDB was configured as "ia64-marcel-freebsd"...
Core was generated by `surf'.
Program terminated with signal 11, Segmentation fault.
Reading symbols from /usr/local/lib/libwebkitgtk-1.0.so.0...Segmentation fault (core dumped)
TZAV> 

top

xxxterm

Version        : 1.10.0,1
Origin         : www/xxxterm

Bug reports: 267

Seems epiphany, midori, surf, xxxterm all indicate a problem with webkit.

% xxxterm 
xxxterm: config_parse: cannot open /home/mexas/.xxxterm.conf: No such file or directory
xxxterm: runtime file doesn't exist, creating it
xxxterm: favorites file doesn't exist, creating it
xxxterm: quickmarks file doesn't exist, creating it
ASSERTION FAILED: isPageAligned(size)
./Source/JavaScriptCore/wtf/PageAllocation.h(101) : static WTF::PageAllocation WTF::PageAllocation::allocate(size_t, WTF::OSAllocator::Usage, bool, bool)
Segmentation fault (core dumped)

% gdb /usr/local/bin/xxxterm xxxterm.core 
GNU gdb 6.1.1 [FreeBSD]
Copyright 2004 Free Software Foundation, Inc.
GDB is free software, covered by the GNU General Public License, and you are
welcome to change it and/or distribute copies of it under certain conditions.
Type "show copying" to see the conditions.
There is absolutely no warranty for GDB.  Type "show warranty" for details.
This GDB was configured as "ia64-marcel-freebsd"...
Core was generated by `xxxterm'.
Program terminated with signal 11, Segmentation fault.
Reading symbols from /usr/local/lib/libwebkitgtk-1.0.so.0...Segmentation fault (core dumped)
TZAV> 

top

dillo

Version        : 3.0.2
Origin         : www/dillo2
% dillo
Segmentation fault (core dumped)

% gdb /usr/local/bin/dillo dillo.core
GNU gdb 6.1.1 [FreeBSD]
Copyright 2004 Free Software Foundation, Inc.
GDB is free software, covered by the GNU General Public License, and you are
welcome to change it and/or distribute copies of it under certain conditions.
Type "show copying" to see the conditions.
There is absolutely no warranty for GDB.  Type "show warranty" for details.
This GDB was configured as "ia64-marcel-freebsd"...
Core was generated by `dillo'.
Program terminated with signal 11, Segmentation fault.
Reading symbols from /usr/local/lib/libjpeg.so.11...done.
Loaded symbols for /usr/local/lib/libjpeg.so.11
Reading symbols from /usr/local/lib/libpng.so.6...done.
Loaded symbols for /usr/local/lib/libpng.so.6
Reading symbols from /lib/libz.so.6...done.
Loaded symbols for /lib/libz.so.6
Reading symbols from /lib/libm.so.5...done.
Loaded symbols for /lib/libm.so.5
Reading symbols from /usr/local/lib/libfltk.so.1.3...done.
Loaded symbols for /usr/local/lib/libfltk.so.1.3
Reading symbols from /usr/local/lib/libXext.so.6...done.
Loaded symbols for /usr/local/lib/libXext.so.6
Reading symbols from /usr/local/lib/libXft.so.2...done.
Loaded symbols for /usr/local/lib/libXft.so.2
Reading symbols from /usr/local/lib/libfontconfig.so.1...done.
Loaded symbols for /usr/local/lib/libfontconfig.so.1
Reading symbols from /usr/local/lib/libXinerama.so.1...done.
Loaded symbols for /usr/local/lib/libXinerama.so.1
Reading symbols from /lib/libthr.so.3...done.
Loaded symbols for /lib/libthr.so.3
Reading symbols from /usr/local/lib/libX11.so.6...done.
Loaded symbols for /usr/local/lib/libX11.so.6
Reading symbols from /usr/local/lib/libiconv.so.3...done.
Loaded symbols for /usr/local/lib/libiconv.so.3
Reading symbols from /lib/libc.so.7...done.
Loaded symbols for /lib/libc.so.7
Reading symbols from /usr/lib/libstdc++.so.6...done.
Loaded symbols for /usr/lib/libstdc++.so.6
Reading symbols from /lib/libgcc_s.so.1...done.
Loaded symbols for /lib/libgcc_s.so.1
Reading symbols from /usr/local/lib/libxcb.so.2...done.
Loaded symbols for /usr/local/lib/libxcb.so.2
Reading symbols from /usr/local/lib/libXau.so.6...done.
Loaded symbols for /usr/local/lib/libXau.so.6
Reading symbols from /usr/local/lib/libXdmcp.so.6...done.
Loaded symbols for /usr/local/lib/libXdmcp.so.6
Reading symbols from /usr/local/lib/libpthread-stubs.so.0...done.
Loaded symbols for /usr/local/lib/libpthread-stubs.so.0
Reading symbols from /usr/lib/librpcsvc.so.5...done.
Loaded symbols for /usr/lib/librpcsvc.so.5
Reading symbols from /usr/local/lib/libfreetype.so.9...done.
Loaded symbols for /usr/local/lib/libfreetype.so.9
Reading symbols from /usr/local/lib/libXrender.so.1...done.
Loaded symbols for /usr/local/lib/libXrender.so.1
Reading symbols from /usr/local/lib/libexpat.so.6...done.
Loaded symbols for /usr/local/lib/libexpat.so.6
Reading symbols from /usr/lib/libbz2.so.4...done.
Loaded symbols for /usr/lib/libbz2.so.4
Reading symbols from /libexec/ld-elf.so.1...done.
Loaded symbols for /libexec/ld-elf.so.1
#0  0x00000001208959d1 in pthread_mutex_getprioceiling () from /lib/libthr.so.3
[New Thread 121404400 (LWP 100566/dillo)]
(gdb) bt
#0  0x00000001208959d1 in pthread_mutex_getprioceiling () from /lib/libthr.so.3
#1  0x0000000120896680 in pthread_mutex_lock () from /lib/libthr.so.3
#2  0x000000010017dbc0 in __static_initialization_and_destruction_0 ()
#3  0x0000000000000000 in ?? ()
Previous frame identical to this frame (corrupt stack?)
(gdb) 

top

epiphany

Version        : 2.30.6_2
Origin         : www/epiphany

Seems epiphany, midori, surf, xxxterm all indicate a problem with webkit.

% epiphany 

** (epiphany:11617): WARNING **: Unable to start Zeroconf subsystem

** (epiphany:11617): WARNING **: Throbber animation not found

** (epiphany:11617): WARNING **: Throbber fallback animation not found either
ASSERTION FAILED: isPageAligned(size)
./Source/JavaScriptCore/wtf/PageAllocation.h(101) : static WTF::PageAllocation WTF::PageAllocation::allocate(size_t, WTF::OSAllocator::Usage, bool, bool)
Segmentation fault (core dumped)
%
% gdb /usr/local/bin/epiphany epiphany.core 
GNU gdb 6.1.1 [FreeBSD]
Copyright 2004 Free Software Foundation, Inc.
GDB is free software, covered by the GNU General Public License, and you are
welcome to change it and/or distribute copies of it under certain conditions.
Type "show copying" to see the conditions.
There is absolutely no warranty for GDB.  Type "show warranty" for details.
This GDB was configured as "ia64-marcel-freebsd"...(no debugging symbols found)...
Core was generated by `epiphany'.
Program terminated with signal 11, Segmentation fault.
Reading symbols from /usr/local/lib/libavahi-gobject.so.0...done.
Loaded symbols for /usr/local/lib/libavahi-gobject.so.0
Reading symbols from /usr/local/lib/libavahi-glib.so.1...done.
Loaded symbols for /usr/local/lib/libavahi-glib.so.1
Reading symbols from /usr/local/lib/libavahi-client.so.3...done.
Loaded symbols for /usr/local/lib/libavahi-client.so.3
Reading symbols from /usr/local/lib/libavahi-common.so.3...done.
Loaded symbols for /usr/local/lib/libavahi-common.so.3
Reading symbols from /lib/libssp.so.0...done.
Loaded symbols for /lib/libssp.so.0
Reading symbols from /usr/local/lib/libgconf-2.so.4...done.
Loaded symbols for /usr/local/lib/libgconf-2.so.4
Reading symbols from /usr/local/lib/libORBit-2.so.0...done.
Loaded symbols for /usr/local/lib/libORBit-2.so.0
Reading symbols from /usr/local/lib/libstartup-notification-1.so.0...done.
Loaded symbols for /usr/local/lib/libstartup-notification-1.so.0
Reading symbols from /usr/local/lib/libxcb-util.so.0...done.
Loaded symbols for /usr/local/lib/libxcb-util.so.0
Reading symbols from /usr/local/lib/libX11-xcb.so.1...done.
Loaded symbols for /usr/local/lib/libX11-xcb.so.1
Reading symbols from /usr/local/lib/libnotify.so.4...done.
Loaded symbols for /usr/local/lib/libnotify.so.4
Reading symbols from /usr/local/lib/libsoup-gnome-2.4.so.1...done.
Loaded symbols for /usr/local/lib/libsoup-gnome-2.4.so.1
Reading symbols from /usr/local/lib/libgnome-keyring.so.0...done.
Loaded symbols for /usr/local/lib/libgnome-keyring.so.0
Reading symbols from /usr/local/lib/libgcrypt.so.18...done.
Loaded symbols for /usr/local/lib/libgcrypt.so.18
Reading symbols from /usr/local/lib/libgpg-error.so.0...done.
Loaded symbols for /usr/local/lib/libgpg-error.so.0
Reading symbols from /usr/local/lib/libdbus-glib-1.so.2...done.
Loaded symbols for /usr/local/lib/libdbus-glib-1.so.2
Reading symbols from /usr/local/lib/libdbus-1.so.3...done.
Loaded symbols for /usr/local/lib/libdbus-1.so.3
Reading symbols from /usr/local/lib/libseed.so.0...done.
Loaded symbols for /usr/local/lib/libseed.so.0
Reading symbols from /usr/local/lib/libwebkitgtk-1.0.so.0...Segmentation fault (core dumped)
%
% gdb /usr/bin/gdb gdb.core 
GNU gdb 6.1.1 [FreeBSD]
Copyright 2004 Free Software Foundation, Inc.
GDB is free software, covered by the GNU General Public License, and you are
welcome to change it and/or distribute copies of it under certain conditions.
Type "show copying" to see the conditions.
There is absolutely no warranty for GDB.  Type "show warranty" for details.
This GDB was configured as "ia64-marcel-freebsd"...
Core was generated by `gdb'.
Program terminated with signal 11, Segmentation fault.
Reading symbols from /lib/libm.so.5...done.
Loaded symbols for /lib/libm.so.5
Reading symbols from /lib/libreadline.so.8...done.
Loaded symbols for /lib/libreadline.so.8
Reading symbols from /lib/libncurses.so.8...done.
Loaded symbols for /lib/libncurses.so.8
Reading symbols from /usr/lib/libgnuregex.so.5...done.
Loaded symbols for /usr/lib/libgnuregex.so.5
Reading symbols from /lib/libc.so.7...done.
Loaded symbols for /lib/libc.so.7
Reading symbols from /usr/lib/libthread_db.so...done.
Loaded symbols for /usr/lib/libthread_db.so
Reading symbols from /libexec/ld-elf.so.1...done.
Loaded symbols for /libexec/ld-elf.so.1
#0  0x0000000120ae4e31 in bcopy () from /lib/libc.so.7
(gdb) bt
#0  0x0000000120ae4e31 in bcopy () from /lib/libc.so.7
#1  0x0000000120aa9e10 in fseek () from /lib/libc.so.7
#2  0x0000000000000000 in ?? ()
Previous frame identical to this frame (corrupt stack?)
(gdb) 

top

rekonq

Version        : 0.8.1_1
Origin         : www/rekonq

Bug reports: 296433. Note that konqueror and rekonq seem to segfault with the same backtrace.

% rekonq 
unnamed app(11731): Communication problem with  "rekonq" , it probably crashed. 
Error message was:  "org.freedesktop.DBus.Error.NoReply" : " "Message did not receive a reply (eout by message bus)" " 

% gdb /usr/local/kde4/bin/rekonq rekonq.core 
GNU gdb 6.1.1 [FreeBSD]
Copyright 2004 Free Software Foundation, Inc.
GDB is free software, covered by the GNU General Public License, and you are
welcome to change it and/or distribute copies of it under certain conditions.
Type "show copying" to see the conditions.
There is absolutely no warranty for GDB.  Type "show warranty" for details.
This GDB was configured as "ia64-marcel-freebsd"...(no debugging symbols found)...
Core was generated by `rekonq'.
Program terminated with signal 11, Segmentation fault.
Reading symbols from /usr/local/kde4/lib/libkdeinit4_rekonq.so...(no debugging symbols found)..ne.
Loaded symbols for /usr/local/kde4/lib/libkdeinit4_rekonq.so
Reading symbols from /usr/local/lib/qt4/libQtScript.so.4...done.
Loaded symbols for /usr/local/lib/qt4/libQtScript.so.4
Reading symbols from /usr/local/kde4/lib/libkdewebkit.so.7...done.
Loaded symbols for /usr/local/kde4/lib/libkdewebkit.so.7
Reading symbols from /usr/local/lib/qt4/libQtWebKit.so.4...done.
Loaded symbols for /usr/local/lib/qt4/libQtWebKit.so.4
Reading symbols from /usr/local/kde4/lib/libkutils.so.5...done.
Loaded symbols for /usr/local/kde4/lib/libkutils.so.5
Reading symbols from /usr/local/kde4/lib/libkemoticons.so.5...done.
Loaded symbols for /usr/local/kde4/lib/libkemoticons.so.5
Reading symbols from /usr/local/kde4/lib/libkidletime.so.5...done.
Loaded symbols for /usr/local/kde4/lib/libkidletime.so.5
Reading symbols from /usr/local/kde4/lib/libkcmutils.so.5...done.
Loaded symbols for /usr/local/kde4/lib/libkcmutils.so.5
Reading symbols from /usr/local/kde4/lib/libkprintutils.so.5...done.
Loaded symbols for /usr/local/kde4/lib/libkprintutils.so.5
Reading symbols from /usr/local/kde4/lib/libkparts.so.5...done.
Loaded symbols for /usr/local/kde4/lib/libkparts.so.5
Reading symbols from /usr/local/kde4/lib/libkio.so.7...done.
Loaded symbols for /usr/local/kde4/lib/libkio.so.7
Reading symbols from /usr/local/lib/qt4/libQtNetwork.so.4...done.
Loaded symbols for /usr/local/lib/qt4/libQtNetwork.so.4
Reading symbols from /usr/local/lib/qt4/libQtXml.so.4...done.
Loaded symbols for /usr/local/lib/qt4/libQtXml.so.4
Reading symbols from /usr/local/kde4/lib/libnepomukutils.so.5...done.
Loaded symbols for /usr/local/kde4/lib/libnepomukutils.so.5
Reading symbols from /usr/local/kde4/lib/libnepomuk.so.5...done.
Loaded symbols for /usr/local/kde4/lib/libnepomuk.so.5
Reading symbols from /usr/local/kde4/lib/libkdeui.so.7...done.
Loaded symbols for /usr/local/kde4/lib/libkdeui.so.7
Reading symbols from /usr/local/lib/qt4/libQtGui.so.4...done.
Loaded symbols for /usr/local/lib/qt4/libQtGui.so.4
Reading symbols from /usr/local/lib/qt4/libQtSvg.so.4...done.
Loaded symbols for /usr/local/lib/qt4/libQtSvg.so.4
Reading symbols from /usr/local/kde4/lib/libkdecore.so.7...done.
Loaded symbols for /usr/local/kde4/lib/libkdecore.so.7
Reading symbols from /usr/local/lib/qt4/libQtDBus.so.4...done.
Loaded symbols for /usr/local/lib/qt4/libQtDBus.so.4
Reading symbols from /usr/local/lib/libsoprano.so.4...done.
Loaded symbols for /usr/local/lib/libsoprano.so.4
Reading symbols from /usr/local/kde4/lib/libthreadweaver.so.5...done.
Loaded symbols for /usr/local/kde4/lib/libthreadweaver.so.5
Reading symbols from /usr/local/lib/qt4/libQtCore.so.4...done.
Loaded symbols for /usr/local/lib/qt4/libQtCore.so.4
Reading symbols from /usr/lib/libstdc++.so.6...done.
Loaded symbols for /usr/lib/libstdc++.so.6
Reading symbols from /lib/libm.so.5...done.
Loaded symbols for /lib/libm.so.5
Reading symbols from /lib/libgcc_s.so.1...done.
Loaded symbols for /lib/libgcc_s.so.1
Reading symbols from /lib/libthr.so.3...done.
Loaded symbols for /lib/libthr.so.3
Reading symbols from /lib/libc.so.7...done.
Loaded symbols for /lib/libc.so.7
Reading symbols from /usr/local/lib/libXrender.so.1...done.
Loaded symbols for /usr/local/lib/libXrender.so.1
Reading symbols from /usr/local/lib/qt4/libphonon.so.4...done.
Loaded symbols for /usr/local/lib/qt4/libphonon.so.4
Reading symbols from /usr/local/lib/libfontconfig.so.1...done.
Loaded symbols for /usr/local/lib/libfontconfig.so.1
Reading symbols from /usr/local/lib/libfreetype.so.9...done.
Loaded symbols for /usr/local/lib/libfreetype.so.9
Reading symbols from /usr/local/lib/libXext.so.6...done.
Loaded symbols for /usr/local/lib/libXext.so.6
Reading symbols from /usr/local/lib/libX11.so.6...done.
Loaded symbols for /usr/local/lib/libX11.so.6
Reading symbols from /usr/local/lib/libSM.so.6...done.
Loaded symbols for /usr/local/lib/libSM.so.6
Reading symbols from /usr/local/lib/libICE.so.6...done.
Loaded symbols for /usr/local/lib/libICE.so.6
Reading symbols from /usr/local/lib/libXft.so.2...done.
Loaded symbols for /usr/local/lib/libXft.so.2
Reading symbols from /usr/local/lib/libXau.so.6...done.
Loaded symbols for /usr/local/lib/libXau.so.6
Reading symbols from /usr/local/lib/libXdmcp.so.6...done.
Loaded symbols for /usr/local/lib/libXdmcp.so.6
Reading symbols from /usr/local/lib/libXpm.so.4...done.
Loaded symbols for /usr/local/lib/libXpm.so.4
Reading symbols from /usr/local/kde4/lib/libnepomukquery.so.5...done.
Loaded symbols for /usr/local/kde4/lib/libnepomukquery.so.5
Reading symbols from /lib/libz.so.6...done.
Loaded symbols for /lib/libz.so.6
Reading symbols from /usr/local/lib/libstreamanalyzer.so.0...done.
Loaded symbols for /usr/local/lib/libstreamanalyzer.so.0
Reading symbols from /usr/local/lib/libstreams.so.0...done.
Loaded symbols for /usr/local/lib/libstreams.so.0
Reading symbols from /usr/local/kde4/lib/libsolid.so.5...done.
Loaded symbols for /usr/local/kde4/lib/libsolid.so.5
Reading symbols from /usr/local/lib/libsopranoclient.so.1...done.
Loaded symbols for /usr/local/lib/libsopranoclient.so.1
Reading symbols from /usr/local/lib/libqca.so.2...done.
Loaded symbols for /usr/local/lib/libqca.so.2
Reading symbols from /usr/local/lib/libattica.so.0...done.
Loaded symbols for /usr/local/lib/libattica.so.0
Reading symbols from /usr/local/lib/libdbusmenu-qt.so.2...done.
Loaded symbols for /usr/local/lib/libdbusmenu-qt.so.2
Reading symbols from /usr/local/lib/libXtst.so.6...done.
Loaded symbols for /usr/local/lib/libXtst.so.6
Reading symbols from /usr/local/lib/libXcursor.so.1...done.
Loaded symbols for /usr/local/lib/libXcursor.so.1
Reading symbols from /usr/local/lib/libXfixes.so.3...done.
Loaded symbols for /usr/local/lib/libXfixes.so.3
Reading symbols from /usr/local/lib/libgthread-2.0.so.0...done.
Loaded symbols for /usr/local/lib/libgthread-2.0.so.0
Reading symbols from /usr/local/lib/libglib-2.0.so.0...done.
Loaded symbols for /usr/local/lib/libglib-2.0.so.0
Reading symbols from /usr/local/lib/libpng.so.6...done.
Loaded symbols for /usr/local/lib/libpng.so.6
Reading symbols from /usr/lib/libbz2.so.4...done.
Loaded symbols for /usr/lib/libbz2.so.4
Reading symbols from /usr/lib/liblzma.so.5...done.
Loaded symbols for /usr/lib/liblzma.so.5
Reading symbols from /usr/local/lib/libintl.so.9...done.
Loaded symbols for /usr/local/lib/libintl.so.9
Reading symbols from /usr/local/lib/libfam.so.0...done.
Loaded symbols for /usr/local/lib/libfam.so.0
Reading symbols from /usr/local/lib/libiconv.so.3...done.
Loaded symbols for /usr/local/lib/libiconv.so.3
Reading symbols from /usr/local/lib/libxcb.so.2...done.
Loaded symbols for /usr/local/lib/libxcb.so.2
Reading symbols from /usr/local/lib/libpthread-stubs.so.0...done.
Loaded symbols for /usr/local/lib/libpthread-stubs.so.0
Reading symbols from /usr/lib/librpcsvc.so.5...done.
Loaded symbols for /usr/lib/librpcsvc.so.5
Reading symbols from /usr/local/lib/libqzeitgeist.so.0...done.
Loaded symbols for /usr/local/lib/libqzeitgeist.so.0
Reading symbols from /usr/local/lib/qt4/libQtTest.so.4...done.
Loaded symbols for /usr/local/lib/qt4/libQtTest.so.4
Reading symbols from /usr/local/lib/libexpat.so.6...done.
Loaded symbols for /usr/local/lib/libexpat.so.6
Reading symbols from /usr/local/lib/libxml2.so.5...done.
Loaded symbols for /usr/local/lib/libxml2.so.5
Reading symbols from /usr/local/lib/libHUpnp.so.1...done.
Loaded symbols for /usr/local/lib/libHUpnp.so.1
Reading symbols from /usr/local/lib/libXi.so.6...done.
Loaded symbols for /usr/local/lib/libXi.so.6
Reading symbols from /usr/local/lib/libicui18n.so.48...done.
Loaded symbols for /usr/local/lib/libicui18n.so.48
Reading symbols from /usr/local/lib/libpcre.so.1...done.
Loaded symbols for /usr/local/lib/libpcre.so.1
Reading symbols from /usr/local/lib/libQtSolutions_SOAP-2.7.so.1...done.
Loaded symbols for /usr/local/lib/libQtSolutions_SOAP-2.7.so.1
Reading symbols from /usr/local/lib/libicuuc.so.48...done.
Loaded symbols for /usr/local/lib/libicuuc.so.48
Reading symbols from /usr/local/lib/libicudata.so.48...done.
Loaded symbols for /usr/local/lib/libicudata.so.48
Reading symbols from /usr/local/lib/libdbus-1.so.3...done.
Loaded symbols for /usr/local/lib/libdbus-1.so.3
Reading symbols from /usr/local/lib/libXrandr.so.2...done.
Loaded symbols for /usr/local/lib/libXrandr.so.2
Reading symbols from /usr/local/lib/libXinerama.so.1...done.
Loaded symbols for /usr/local/lib/libXinerama.so.1
Reading symbols from /libexec/ld-elf.so.1...done.
Loaded symbols for /libexec/ld-elf.so.1
#0  0x000000012799c931 in KSharedDataCache::find () from /usr/local/kde4/lib/libkdecore.so.7
[New Thread 12c004400 (LWP 100073/rekonq)]
(gdb) bt
#0  0x000000012799c931 in KSharedDataCache::find () from /usr/local/kde4/lib/libkdecore.so.7
#1  0x000000012537c350 in KIconLoader::~KIconLoader () from /usr/local/kde4/lib/libkdeui.so.7
#2  0x0000000000000000 in ?? ()
Previous frame identical to this frame (corrupt stack?)
(gdb) 

top

arora

Version        : 0.11.0
Origin         : www/arora
% arora
Failed to load translation: "C" 
Illegal instruction (core dumped)

% gdb /usr/local/bin/arora arora.core 
GNU gdb 6.1.1 [FreeBSD]
Copyright 2004 Free Software Foundation, Inc.
GDB is free software, covered by the GNU General Public License, and you are
welcome to change it and/or distribute copies of it under certain conditions.
Type "show copying" to see the conditions.
There is absolutely no warranty for GDB.  Type "show warranty" for details.
This GDB was configured as "ia64-marcel-freebsd"...
Core was generated by `arora'.
Program terminated with signal 4, Illegal instruction.
Reading symbols from /usr/local/lib/qt4/libQtWebKit.so.4...done.
Loaded symbols for /usr/local/lib/qt4/libQtWebKit.so.4
Reading symbols from /usr/local/lib/qt4/libQtScript.so.4...done.
Loaded symbols for /usr/local/lib/qt4/libQtScript.so.4
Reading symbols from /usr/local/lib/qt4/libQtGui.so.4...done.
Loaded symbols for /usr/local/lib/qt4/libQtGui.so.4
Reading symbols from /usr/local/lib/qt4/libQtNetwork.so.4...done.
Loaded symbols for /usr/local/lib/qt4/libQtNetwork.so.4
Reading symbols from /usr/local/lib/qt4/libQtCore.so.4...done.
Loaded symbols for /usr/local/lib/qt4/libQtCore.so.4
Reading symbols from /usr/lib/libstdc++.so.6...done.
Loaded symbols for /usr/lib/libstdc++.so.6
Reading symbols from /lib/libm.so.5...done.
Loaded symbols for /lib/libm.so.5
Reading symbols from /lib/libgcc_s.so.1...done.
Loaded symbols for /lib/libgcc_s.so.1
Reading symbols from /lib/libthr.so.3...done.
Loaded symbols for /lib/libthr.so.3
Reading symbols from /lib/libc.so.7...done.
Loaded symbols for /lib/libc.so.7
Reading symbols from /usr/local/lib/libXrender.so.1...done.
Loaded symbols for /usr/local/lib/libXrender.so.1
Reading symbols from /usr/local/lib/qt4/libphonon.so.4...done.
Loaded symbols for /usr/local/lib/qt4/libphonon.so.4
Reading symbols from /usr/local/lib/qt4/libQtDBus.so.4...done.
Loaded symbols for /usr/local/lib/qt4/libQtDBus.so.4
Reading symbols from /usr/local/lib/qt4/libQtXml.so.4...done.
Loaded symbols for /usr/local/lib/qt4/libQtXml.so.4
Reading symbols from /usr/local/lib/libfontconfig.so.1...done.
Loaded symbols for /usr/local/lib/libfontconfig.so.1
Reading symbols from /usr/local/lib/libfreetype.so.9...done.
Loaded symbols for /usr/local/lib/libfreetype.so.9
Reading symbols from /usr/local/lib/libXext.so.6...done.
Loaded symbols for /usr/local/lib/libXext.so.6
Reading symbols from /usr/local/lib/libX11.so.6...done.
Loaded symbols for /usr/local/lib/libX11.so.6
Reading symbols from /usr/local/lib/libgthread-2.0.so.0...done.
Loaded symbols for /usr/local/lib/libgthread-2.0.so.0
Reading symbols from /usr/local/lib/libglib-2.0.so.0...done.
Loaded symbols for /usr/local/lib/libglib-2.0.so.0
Reading symbols from /usr/local/lib/libpng.so.6...done.
Loaded symbols for /usr/local/lib/libpng.so.6
Reading symbols from /lib/libz.so.6...done.
Loaded symbols for /lib/libz.so.6
Reading symbols from /usr/local/lib/libSM.so.6...done.
Loaded symbols for /usr/local/lib/libSM.so.6
Reading symbols from /usr/local/lib/libICE.so.6...done.
Loaded symbols for /usr/local/lib/libICE.so.6
Reading symbols from /usr/local/lib/libiconv.so.3...done.
Loaded symbols for /usr/local/lib/libiconv.so.3
Reading symbols from /usr/local/lib/libxcb.so.2...done.
Loaded symbols for /usr/local/lib/libxcb.so.2
Reading symbols from /usr/local/lib/libXau.so.6...done.
Loaded symbols for /usr/local/lib/libXau.so.6
Reading symbols from /usr/local/lib/libXdmcp.so.6...done.
Loaded symbols for /usr/local/lib/libXdmcp.so.6
Reading symbols from /usr/local/lib/libpthread-stubs.so.0...done.
Loaded symbols for /usr/local/lib/libpthread-stubs.so.0
Reading symbols from /usr/lib/librpcsvc.so.5...done.
Loaded symbols for /usr/lib/librpcsvc.so.5
Reading symbols from /usr/local/lib/libqzeitgeist.so.0...done.
Loaded symbols for /usr/local/lib/libqzeitgeist.so.0
Reading symbols from /usr/local/lib/qt4/libQtTest.so.4...done.
Loaded symbols for /usr/local/lib/qt4/libQtTest.so.4
Reading symbols from /usr/local/lib/libexpat.so.6...done.
Loaded symbols for /usr/local/lib/libexpat.so.6
Reading symbols from /usr/lib/libbz2.so.4...done.
Loaded symbols for /usr/lib/libbz2.so.4
Reading symbols from /usr/local/lib/libicui18n.so.48...done.
Loaded symbols for /usr/local/lib/libicui18n.so.48
Reading symbols from /usr/local/lib/libintl.so.9...done.
Loaded symbols for /usr/local/lib/libintl.so.9
Reading symbols from /usr/local/lib/libpcre.so.1...done.
Loaded symbols for /usr/local/lib/libpcre.so.1
Reading symbols from /usr/local/lib/libicuuc.so.48...done.
Loaded symbols for /usr/local/lib/libicuuc.so.48
Reading symbols from /usr/local/lib/libicudata.so.48...done.
Loaded symbols for /usr/local/lib/libicudata.so.48
Reading symbols from /usr/local/lib/libXrandr.so.2...done.
Loaded symbols for /usr/local/lib/libXrandr.so.2
Reading symbols from /usr/local/lib/libXfixes.so...done.
Loaded symbols for /usr/local/lib/libXfixes.so
Reading symbols from /usr/local/lib/libXcursor.so.1...done.
Loaded symbols for /usr/local/lib/libXcursor.so.1
Reading symbols from /usr/local/lib/libXinerama.so.1...done.
Loaded symbols for /usr/local/lib/libXinerama.so.1
Reading symbols from /usr/local/lib/libXi.so...done.
Loaded symbols for /usr/local/lib/libXi.so
Reading symbols from /usr/lib/libcrypto.so...done.
Loaded symbols for /usr/lib/libcrypto.so
Reading symbols from /usr/lib/libssl.so...done.
Loaded symbols for /usr/lib/libssl.so
Reading symbols from /usr/local/lib/qt4/plugins/imageformats/libqgif.so...done.
Loaded symbols for /usr/local/lib/qt4/plugins/imageformats/libqgif.so
Reading symbols from /usr/local/lib/qt4/plugins/imageformats/libqico.so...done.
Loaded symbols for /usr/local/lib/qt4/plugins/imageformats/libqico.so
Reading symbols from /usr/local/lib/qt4/plugins/imageformats/libqjpeg.so...done.
Loaded symbols for /usr/local/lib/qt4/plugins/imageformats/libqjpeg.so
Reading symbols from /usr/local/lib/libjpeg.so.11...done.
Loaded symbols for /usr/local/lib/libjpeg.so.11
Reading symbols from /usr/local/lib/qt4/plugins/imageformats/libqmng.so...done.
Loaded symbols for /usr/local/lib/qt4/plugins/imageformats/libqmng.so
Reading symbols from /usr/local/lib/libmng.so.1...done.
Loaded symbols for /usr/local/lib/libmng.so.1
Reading symbols from /usr/local/lib/liblcms.so.1...done.
Loaded symbols for /usr/local/lib/liblcms.so.1
Reading symbols from /usr/local/lib/qt4/plugins/imageformats/libqsvg.so...done.
Loaded symbols for /usr/local/lib/qt4/plugins/imageformats/libqsvg.so
Reading symbols from /usr/local/lib/qt4/libQtSvg.so.4...done.
Loaded symbols for /usr/local/lib/qt4/libQtSvg.so.4
Reading symbols from /usr/local/lib/qt4/plugins/imageformats/libqtiff.so...done.
Loaded symbols for /usr/local/lib/qt4/plugins/imageformats/libqtiff.so
Reading symbols from /usr/local/lib/libtiff.so.4...done.
Loaded symbols for /usr/local/lib/libtiff.so.4
Reading symbols from /usr/lib/liblzma.so.5...done.
Loaded symbols for /usr/lib/liblzma.so.5
Reading symbols from /usr/local/lib/libjbig.so.1...done.
Loaded symbols for /usr/local/lib/libjbig.so.1
Reading symbols from /libexec/ld-elf.so.1...done.
Loaded symbols for /libexec/ld-elf.so.1
#0  0x000000012625fc00 in _setjmp () from /lib/libc.so.7
[New Thread 12e6d8400 (LWP 101475/arora)]
[New Thread 1297d7000 (LWP 101474/arora)]
[New Thread 1297d6c00 (LWP 100452/arora)]
[New Thread 1297d4400 (LWP 100446/arora)]
[New Thread 128c04400 (LWP 100503/arora)]
(gdb) 

top

netsurf

Version        : 3.0_2
Origin         : www/netsurf

Seems to work, but no javascript.

top

browsers which don't even build

firefox

PORTNAME=       firefox
DISTVERSION=    doesn't matter, due to multiple issues,
                can't use the ports version, have to
                build/patch trunk.

Bug reports: 638056, 647830, 683879, 691898, 729447

top

seamonkey

PORTNAME=       seamonkey
DISTVERSION=    2.8

Bug reports: 729447

top

libxul

Version        : 1.9.2.28
Origin         : www/libxul

Bug reports: 657309

Script started on Mon Mar 19 09:34:15 2012
make
===>  Building for libxul-1.9.2.28
rm -f -rf ./dist/sdk
Section [Build] not found.
rm -f -rf ./dist/include
rm -f -rf ./dist/private
rm -f -rf ./dist/public
rm -f -rf ./dist/bin/components
rm -f -rf _tests
Section [Build] not found.
gmake[1]: Entering directory `/usr/ports/www/libxul/work/mozilla-1.9.2'
Section [Build] not found.
tier_base:  config build probes 
gmake export_tier_base
gmake[2]: Entering directory `/usr/ports/www/libxul/work/mozilla-1.9.2'
Section [Build] not found.
export_tier_base
gmake[3]: Entering directory `/usr/ports/www/libxul/work/mozilla-1.9.2'
gmake[3]: `config/Makefile' is up to date.
gmake[3]: `build/Makefile' is up to date.
gmake[3]: `probes/Makefile' is up to date.
gmake[3]: Leaving directory `/usr/ports/www/libxul/work/mozilla-1.9.2'
gmake[3]: Entering directory `/usr/ports/www/libxul/work/mozilla-1.9.2/config'
/usr/ports/www/libxul/work/mozilla-1.9.2/config/nsinstall -R -m 644 ../mozilla-config.h ./nsStaticComponents.h  ../dist/include
rm -f ../config/final-link-comps ../config/final-link-libs ../config/final-link-comp-names
rm -f ../dist/bin/chrome/chromelist.txt
/usr/ports/www/libxul/work/mozilla-1.9.2/config/nsinstall -R nsinstall ../dist/bin
/usr/local/bin/python ../toolkit/xre/make-platformini.py --print-buildid > buildid
gmake[3]: Leaving directory `/usr/ports/www/libxul/work/mozilla-1.9.2/config'
gmake[3]: Entering directory `/usr/ports/www/libxul/work/mozilla-1.9.2/build'
gmake[4]: Entering directory `/usr/ports/www/libxul/work/mozilla-1.9.2/build/unix'
gmake[4]: Nothing to be done for `export'.
gmake[4]: Leaving directory `/usr/ports/www/libxul/work/mozilla-1.9.2/build/unix'
gmake[4]: Entering directory `/usr/ports/www/libxul/work/mozilla-1.9.2/build/pgo'
gmake[5]: Entering directory `/usr/ports/www/libxul/work/mozilla-1.9.2/build/pgo/blueprint'
gmake[5]: Nothing to be done for `export'.
gmake[5]: Leaving directory `/usr/ports/www/libxul/work/mozilla-1.9.2/build/pgo/blueprint'
gmake[5]: Entering directory `/usr/ports/www/libxul/work/mozilla-1.9.2/build/pgo/js-input'
gmake[5]: Nothing to be done for `export'.
gmake[5]: Leaving directory `/usr/ports/www/libxul/work/mozilla-1.9.2/build/pgo/js-input'
gmake[4]: Leaving directory `/usr/ports/www/libxul/work/mozilla-1.9.2/build/pgo'
gmake[3]: Leaving directory `/usr/ports/www/libxul/work/mozilla-1.9.2/build'
gmake[3]: Entering directory `/usr/ports/www/libxul/work/mozilla-1.9.2/probes'
gmake[3]: Nothing to be done for `export'.
gmake[3]: Leaving directory `/usr/ports/www/libxul/work/mozilla-1.9.2/probes'
gmake[2]: Leaving directory `/usr/ports/www/libxul/work/mozilla-1.9.2'
gmake libs_tier_base
gmake[2]: Entering directory `/usr/ports/www/libxul/work/mozilla-1.9.2'
Section [Build] not found.
libs_tier_base
gmake[3]: Entering directory `/usr/ports/www/libxul/work/mozilla-1.9.2'
gmake[3]: `config/Makefile' is up to date.
gmake[3]: `build/Makefile' is up to date.
gmake[3]: `probes/Makefile' is up to date.
gmake[3]: Leaving directory `/usr/ports/www/libxul/work/mozilla-1.9.2'
gmake[3]: Entering directory `/usr/ports/www/libxul/work/mozilla-1.9.2/config'
/usr/ports/www/libxul/work/mozilla-1.9.2/config/nsinstall -R -m 755 nsinstall ../dist/host/bin
gmake[3]: Leaving directory `/usr/ports/www/libxul/work/mozilla-1.9.2/config'
gmake[3]: Entering directory `/usr/ports/www/libxul/work/mozilla-1.9.2/build'
gmake[4]: Entering directory `/usr/ports/www/libxul/work/mozilla-1.9.2/build/unix'
/usr/ports/www/libxul/work/mozilla-1.9.2/config/nsinstall -R run-mozilla.sh ../../dist/bin
gmake[4]: Leaving directory `/usr/ports/www/libxul/work/mozilla-1.9.2/build/unix'
gmake[4]: Entering directory `/usr/ports/www/libxul/work/mozilla-1.9.2/build/pgo'
gmake[5]: Entering directory `/usr/ports/www/libxul/work/mozilla-1.9.2/build/pgo/blueprint'
/usr/ports/www/libxul/work/mozilla-1.9.2/config/nsinstall -R sample.html elements.html forms.html grid.html test.jpg test-small.jpg valid.png screen.css print.css grid.png fancytype-screen.css ../../../_profile/pgo/blueprint
gmake[5]: Leaving directory `/usr/ports/www/libxul/work/mozilla-1.9.2/build/pgo/blueprint'
gmake[5]: Entering directory `/usr/ports/www/libxul/work/mozilla-1.9.2/build/pgo/js-input'
/usr/ports/www/libxul/work/mozilla-1.9.2/config/nsinstall -R 3d-cube.html 3d-morph.html 3d-raytrace.html 3d-thingy.html access-binary-trees.html access-fannkuch.html access-nbody.html access-nsieve.html bitops-3bit-bits-in-byte.html bitops-bits-in-byte.html bitops-bitwise-and.html bitops-nsieve-bits.html controlflow-recursive.html crypto-aes.html crypto-md5.html crypto-sha1.html crypto-otp.html date-format-tofte.html date-format-xparb.html math-cordic.html math-partial-sums.html math-spectral-norm.html regexp-dna.html string-base64.html string-fasta.html string-tagcloud.html string-unpack-code.html string-validate-input.html key.gif valid-xhtml10.png ../../../_profile/pgo/js-input
gmake[5]: Leaving directory `/usr/ports/www/libxul/work/mozilla-1.9.2/build/pgo/js-input'
/usr/ports/www/libxul/work/mozilla-1.9.2/config/nsinstall -R automation.py ../../build/automationutils.py profileserver.py genpgocert.py index.html server-locations.txt favicon.ico ../../_profile/pgo
gmake[4]: Leaving directory `/usr/ports/www/libxul/work/mozilla-1.9.2/build/pgo'
/usr/ports/www/libxul/work/mozilla-1.9.2/config/nsinstall -R automation.py automationutils.py leaktest.py bloatcycle.html ../build/pgo/server-locations.txt ../_leaktest
gmake[3]: Leaving directory `/usr/ports/www/libxul/work/mozilla-1.9.2/build'
gmake[3]: Entering directory `/usr/ports/www/libxul/work/mozilla-1.9.2/probes'
gmake[3]: Nothing to be done for `libs'.
gmake[3]: Leaving directory `/usr/ports/www/libxul/work/mozilla-1.9.2/probes'
gmake[2]: Leaving directory `/usr/ports/www/libxul/work/mozilla-1.9.2'
gmake[1]: Leaving directory `/usr/ports/www/libxul/work/mozilla-1.9.2'
gmake[1]: Entering directory `/usr/ports/www/libxul/work/mozilla-1.9.2'
Section [Build] not found.
tier_nspr:  
gmake export_tier_nspr
gmake[2]: Entering directory `/usr/ports/www/libxul/work/mozilla-1.9.2'
Section [Build] not found.
export_tier_nspr
gmake[2]: Leaving directory `/usr/ports/www/libxul/work/mozilla-1.9.2'
gmake libs_tier_nspr
gmake[2]: Entering directory `/usr/ports/www/libxul/work/mozilla-1.9.2'
Section [Build] not found.
libs_tier_nspr
gmake[2]: Leaving directory `/usr/ports/www/libxul/work/mozilla-1.9.2'
Section [Build] not found.
tier_nspr:  
gmake export_tier_nspr
gmake[2]: Entering directory `/usr/ports/www/libxul/work/mozilla-1.9.2'
Section [Build] not found.
export_tier_nspr
gmake[2]: Leaving directory `/usr/ports/www/libxul/work/mozilla-1.9.2'
gmake libs_tier_nspr
gmake[2]: Entering directory `/usr/ports/www/libxul/work/mozilla-1.9.2'
Section [Build] not found.
libs_tier_nspr
gmake[2]: Leaving directory `/usr/ports/www/libxul/work/mozilla-1.9.2'
gmake[1]: Leaving directory `/usr/ports/www/libxul/work/mozilla-1.9.2'
gmake[1]: Entering directory `/usr/ports/www/libxul/work/mozilla-1.9.2'
Section [Build] not found.
tier_js:  js/src
gmake export_tier_js
gmake[2]: Entering directory `/usr/ports/www/libxul/work/mozilla-1.9.2'
Section [Build] not found.
export_tier_js
gmake[3]: Entering directory `/usr/ports/www/libxul/work/mozilla-1.9.2'
gmake[3]: `js/src/Makefile' is up to date.
gmake[3]: Leaving directory `/usr/ports/www/libxul/work/mozilla-1.9.2'
gmake[3]: Entering directory `/usr/ports/www/libxul/work/mozilla-1.9.2/js/src'
gmake[4]: Entering directory `/usr/ports/www/libxul/work/mozilla-1.9.2/js/src/config'
/usr/ports/www/libxul/work/mozilla-1.9.2/js/src/config/nsinstall -R nsinstall ../../../dist/bin
gmake[4]: Leaving directory `/usr/ports/www/libxul/work/mozilla-1.9.2/js/src/config'
gmake[4]: Entering directory `/usr/ports/www/libxul/work/mozilla-1.9.2/js/src/editline'
gmake[4]: Nothing to be done for `export'.
gmake[4]: Leaving directory `/usr/ports/www/libxul/work/mozilla-1.9.2/js/src/editline'
gmake[4]: Entering directory `/usr/ports/www/libxul/work/mozilla-1.9.2/js/src/shell'
gmake[4]: Nothing to be done for `export'.
gmake[4]: Leaving directory `/usr/ports/www/libxul/work/mozilla-1.9.2/js/src/shell'
/usr/ports/www/libxul/work/mozilla-1.9.2/js/src/config/nsinstall -R -m 644 js-config.h jsautocfg.h /usr/ports/www/libxul/work/mozilla-1.9.2/js/src/jsautokw.h js.msg jsapi.h jsarray.h jsarena.h jsatom.h jsbit.h jsbool.h jsclist.h jscntxt.h jscompat.h jsdate.h jsdbgapi.h jsdhash.h jsdtoa.h jsemit.h jsfun.h jsgc.h jshash.h jsinterp.h jsinttypes.h jsiter.h jslock.h jslong.h jsmath.h jsnum.h jsobj.h jsobjinlines.h json.h jsopcode.tbl jsopcode.h jsotypes.h jsparse.h jsprf.h jsproto.tbl jsprvtd.h jspubtd.h jsregexp.h jsscan.h jsscope.h jsscript.h jsscriptinlines.h jsstaticcheck.h jsstr.h jstask.h jstracer.h jstypes.h jsutil.h jsversion.h jsxdrapi.h jsxml.h ./../../dist/include
mkdir -p nanojit
gmake[3]: Leaving directory `/usr/ports/www/libxul/work/mozilla-1.9.2/js/src'
gmake[2]: Leaving directory `/usr/ports/www/libxul/work/mozilla-1.9.2'
gmake libs_tier_js
gmake[2]: Entering directory `/usr/ports/www/libxul/work/mozilla-1.9.2'
Section [Build] not found.
libs_tier_js
gmake[3]: Entering directory `/usr/ports/www/libxul/work/mozilla-1.9.2'
gmake[3]: `js/src/Makefile' is up to date.
gmake[3]: Leaving directory `/usr/ports/www/libxul/work/mozilla-1.9.2'
gmake[3]: Entering directory `/usr/ports/www/libxul/work/mozilla-1.9.2/js/src'
/usr/ports/www/libxul/work/mozilla-1.9.2/js/src/config/nsinstall -R -m 755 libmozjs.so ./../../dist/lib
/usr/ports/www/libxul/work/mozilla-1.9.2/js/src/config/nsinstall -D ../../dist/sdk/lib
/usr/ports/www/libxul/work/mozilla-1.9.2/js/src/config/nsinstall -R -m 755 libmozjs.so ./../../dist/bin
/usr/ports/www/libxul/work/mozilla-1.9.2/js/src/config/nsinstall -R -m 755 host_jskwgen host_jsoplengen ./../../dist/host/bin
gmake[4]: Entering directory `/usr/ports/www/libxul/work/mozilla-1.9.2/js/src/config'
/usr/ports/www/libxul/work/mozilla-1.9.2/js/src/config/nsinstall -R -m 755 nsinstall ../../../dist/host/bin
gmake[4]: Leaving directory `/usr/ports/www/libxul/work/mozilla-1.9.2/js/src/config'
gmake[4]: Entering directory `/usr/ports/www/libxul/work/mozilla-1.9.2/js/src/editline'
gmake[4]: Nothing to be done for `libs'.
gmake[4]: Leaving directory `/usr/ports/www/libxul/work/mozilla-1.9.2/js/src/editline'
gmake[4]: Entering directory `/usr/ports/www/libxul/work/mozilla-1.9.2/js/src/shell'
/usr/ports/www/libxul/work/mozilla-1.9.2/js/src/config/nsinstall -R -m 755 js ../../../dist/bin
/usr/ports/www/libxul/work/mozilla-1.9.2/js/src/config/nsinstall -R -m 755 js ..
gmake[4]: Leaving directory `/usr/ports/www/libxul/work/mozilla-1.9.2/js/src/shell'
/usr/ports/www/libxul/work/mozilla-1.9.2/js/src/config/nsinstall -R -m 755 libmozjs.so ../../dist/sdk/lib
./../../dist/bin/run-mozilla.sh ./../../dist/bin/js imacro_asm.js ./imacros.jsasm > imacros.c.tmp
imacros.c.out is up to date
gmake[3]: Leaving directory `/usr/ports/www/libxul/work/mozilla-1.9.2/js/src'
gmake[2]: Leaving directory `/usr/ports/www/libxul/work/mozilla-1.9.2'
gmake[1]: Leaving directory `/usr/ports/www/libxul/work/mozilla-1.9.2'
gmake[1]: Entering directory `/usr/ports/www/libxul/work/mozilla-1.9.2'
Section [Build] not found.
tier_xpcom:  xpcom
gmake export_tier_xpcom
gmake[2]: Entering directory `/usr/ports/www/libxul/work/mozilla-1.9.2'
Section [Build] not found.
export_tier_xpcom
gmake[3]: Entering directory `/usr/ports/www/libxul/work/mozilla-1.9.2'
gmake[3]: `xpcom/Makefile' is up to date.
gmake[3]: Leaving directory `/usr/ports/www/libxul/work/mozilla-1.9.2'
gmake[3]: Entering directory `/usr/ports/www/libxul/work/mozilla-1.9.2/xpcom'
gmake[4]: Entering directory `/usr/ports/www/libxul/work/mozilla-1.9.2/xpcom/typelib'
gmake[5]: Entering directory `/usr/ports/www/libxul/work/mozilla-1.9.2/xpcom/typelib/xpt'
gmake[6]: Entering directory `/usr/ports/www/libxul/work/mozilla-1.9.2/xpcom/typelib/xpt/public'
/usr/ports/www/libxul/work/mozilla-1.9.2/config/nsinstall -R -m 644 xpt_arena.h xpt_struct.h xpt_xdr.h ../../../../dist/include
gmake[6]: Leaving directory `/usr/ports/www/libxul/work/mozilla-1.9.2/xpcom/typelib/xpt/public'
gmake[6]: Entering directory `/usr/ports/www/libxul/work/mozilla-1.9.2/xpcom/typelib/xpt/src'
gmake[7]: Entering directory `/usr/ports/www/libxul/work/mozilla-1.9.2/xpcom/typelib/xpt/src'
/usr/ports/www/libxul/work/mozilla-1.9.2/config/nsinstall -R -m 644 libxpt.a ../../../../dist/lib
gmake[7]: Leaving directory `/usr/ports/www/libxul/work/mozilla-1.9.2/xpcom/typelib/xpt/src'
gmake[6]: Leaving directory `/usr/ports/www/libxul/work/mozilla-1.9.2/xpcom/typelib/xpt/src'
gmake[6]: Entering directory `/usr/ports/www/libxul/work/mozilla-1.9.2/xpcom/typelib/xpt/tools'
gmake[7]: Entering directory `/usr/ports/www/libxul/work/mozilla-1.9.2/xpcom/typelib/xpt/tools'
/usr/ports/www/libxul/work/mozilla-1.9.2/config/nsinstall -R -m 755 xpt_dump xpt_link ../../../../dist/bin
/usr/ports/www/libxul/work/mozilla-1.9.2/config/nsinstall -D ../../../../dist/sdk/bin
/usr/ports/www/libxul/work/mozilla-1.9.2/config/nsinstall -R -m 755 xpt_dump xpt_link ../../../../dist/sdk/bin
gmake[7]: Leaving directory `/usr/ports/www/libxul/work/mozilla-1.9.2/xpcom/typelib/xpt/tools'
gmake[6]: Leaving directory `/usr/ports/www/libxul/work/mozilla-1.9.2/xpcom/typelib/xpt/tools'
gmake[5]: Leaving directory `/usr/ports/www/libxul/work/mozilla-1.9.2/xpcom/typelib/xpt'
gmake[5]: Entering directory `/usr/ports/www/libxul/work/mozilla-1.9.2/xpcom/typelib/xpidl'
gmake[6]: Entering directory `/usr/ports/www/libxul/work/mozilla-1.9.2/xpcom/typelib/xpidl'
/usr/ports/www/libxul/work/mozilla-1.9.2/config/nsinstall -R -m 755 xpidl ../../../dist/bin
/usr/ports/www/libxul/work/mozilla-1.9.2/config/nsinstall -D ../../../dist/sdk/bin
/usr/ports/www/libxul/work/mozilla-1.9.2/config/nsinstall -R -m 755 xpidl ../../../dist/sdk/bin
gmake[6]: Leaving directory `/usr/ports/www/libxul/work/mozilla-1.9.2/xpcom/typelib/xpidl'
gmake[5]: Leaving directory `/usr/ports/www/libxul/work/mozilla-1.9.2/xpcom/typelib/xpidl'
gmake[4]: Leaving directory `/usr/ports/www/libxul/work/mozilla-1.9.2/xpcom/typelib'
gmake[4]: Entering directory `/usr/ports/www/libxul/work/mozilla-1.9.2/xpcom/string'
gmake[5]: Entering directory `/usr/ports/www/libxul/work/mozilla-1.9.2/xpcom/string/public'
/usr/ports/www/libxul/work/mozilla-1.9.2/config/nsinstall -R -m 644 nsAString.h nsAlgorithm.h nsCharTraits.h nsDependentString.h nsDependentSubstring.h nsLiteralString.h nsPrintfCString.h nsPromiseFlatString.h nsReadableUtils.h nsString.h nsStringBuffer.h nsStringFwd.h nsStringIterator.h nsSubstring.h nsSubstringTuple.h nsTDependentString.h nsTDependentSubstring.h nsTPromiseFlatString.h nsTString.h nsTSubstring.h nsTSubstringTuple.h nsUTF8Utils.h nsXPIDLString.h string-template-def-unichar.h string-template-def-char.h string-template-undef.h nsXPCOMStrings.h nsEmbedString.h ../../../dist/include
gmake[5]: Leaving directory `/usr/ports/www/libxul/work/mozilla-1.9.2/xpcom/string/public'
gmake[5]: Entering directory `/usr/ports/www/libxul/work/mozilla-1.9.2/xpcom/string/src'
gmake[5]: Nothing to be done for `export'.
gmake[5]: Leaving directory `/usr/ports/www/libxul/work/mozilla-1.9.2/xpcom/string/src'
gmake[4]: Leaving directory `/usr/ports/www/libxul/work/mozilla-1.9.2/xpcom/string'
gmake[4]: Entering directory `/usr/ports/www/libxul/work/mozilla-1.9.2/xpcom/glue'
gmake[5]: Entering directory `/usr/ports/www/libxul/work/mozilla-1.9.2/xpcom/glue/standalone'
/usr/ports/www/libxul/work/mozilla-1.9.2/config/nsinstall -R -m 644 nsXPCOMGlue.h ../../../dist/include
/usr/ports/www/libxul/work/mozilla-1.9.2/config/nsinstall -R ../../../xpcom/glue/pldhash.c ../../../xpcom/glue/nsArrayEnumerator.cpp ../../../xpcom/glue/nsArrayUtils.cpp ../../../xpcom/glue/nsCategoryCache.cpp ../../../xpcom/glue/nsCOMPtr.cpp ../../../xpcom/glue/nsCOMArray.cpp ../../../xpcom/glue/nsCRTGlue.cpp ../../../xpcom/glue/nsComponentManagerUtils.cpp ../../../xpcom/glue/nsEnumeratorUtils.cpp ../../../xpcom/glue/nsID.cpp ../../../xpcom/glue/nsIInterfaceRequestorUtils.cpp ../../../xpcom/glue/nsINIParser.cpp ../../../xpcom/glue/nsISupportsImpl.cpp ../../../xpcom/glue/nsMemory.cpp ../../../xpcom/glue/nsWeakReference.cpp ../../../xpcom/glue/nsGREGlue.cpp ../../../xpcom/glue/nsVersionComparator.cpp ../../../xpcom/glue/nsTHashtable.cpp ../../../xpcom/glue/nsQuickSort.cpp ../../../xpcom/glue/nsVoidArray.cpp ../../../xpcom/glue/nsTArray.cpp ../../../xpcom/glue/nsThreadUtils.cpp ../../../xpcom/glue/nsTObserverArray.cpp ../../../xpcom/glue/nsCycleCollectionParticipant.cpp ../../../xpcom/glue/nsDeque.cpp ../../../xpcom/glue/nsStringAPI.cpp .
gmake[5]: Leaving directory `/usr/ports/www/libxul/work/mozilla-1.9.2/xpcom/glue/standalone'
/usr/ports/www/libxul/work/mozilla-1.9.2/config/nsinstall -R -m 644 nsThreadUtils.h nsProxyRelease.h nsXPTCUtils.h nsArrayEnumerator.h nsArrayUtils.h nsAutoLock.h nsBaseHashtable.h nsCOMArray.h nsCOMPtr.h nsCRTGlue.h nsCategoryCache.h nsClassHashtable.h nsComponentManagerUtils.h nsCycleCollectionParticipant.h nsDataHashtable.h nsDebug.h nsDeque.h nsEnumeratorUtils.h nsGenericFactory.h nsHashKeys.h nsIClassInfoImpl.h nsID.h nsIGenericFactory.h nsIInterfaceRequestorUtils.h nsINIParser.h nsISupportsImpl.h nsISupportsUtils.h nsIWeakReferenceUtils.h nsInterfaceHashtable.h nsMemory.h nsQuickSort.h nsRefPtrHashtable.h nsServiceManagerUtils.h nsStringAPI.h nsStringGlue.h nsTArray.h nsTHashtable.h nsTObserverArray.h nsTPtrArray.h nsTWeakRef.h nsTextFormatter.h nsTraceRefcnt.h nsVersionComparator.h nsVoidArray.h nsWeakReference.h pldhash.h ../../dist/include
/usr/ports/www/libxul/work/mozilla-1.9.2/config/nsinstall -R -m 644 BlockingResourceBase.h CondVar.h DeadlockDetector.h Monitor.h Mutex.h ../../dist/include/mozilla
gmake[4]: Leaving directory `/usr/ports/www/libxul/work/mozilla-1.9.2/xpcom/glue'
gmake[4]: Entering directory `/usr/ports/www/libxul/work/mozilla-1.9.2/xpcom/base'
/usr/ports/www/libxul/work/mozilla-1.9.2/config/nsinstall -D ../../dist/idl
/usr/ports/www/libxul/work/mozilla-1.9.2/config/nsinstall -D ../../dist/idl
/usr/ports/www/libxul/work/mozilla-1.9.2/config/nsinstall -R -m 644 nsAgg.h nsAutoRef.h nsCom.h nsDebugImpl.h nsIAllocator.h nsIID.h nsISupportsObsolete.h nsStackWalk.h nsTraceRefcntImpl.h nsWeakPtr.h nsInterfaceRequestorAgg.h nsAutoPtr.h nsError.h nsISupportsBase.h nscore.h nsCycleCollector.h nsObjCExceptions.h ../../dist/include
/usr/ports/www/libxul/work/mozilla-1.9.2/config/nsinstall -R -m 644 nsIConsoleListener.idl nsIConsoleMessage.idl nsIConsoleService.idl nsIDebug2.idl nsIErrorService.idl nsIException.idl nsIExceptionService.idl nsIVersionComparator.idl nsIUUIDGenerator.idl nsIMutable.idl nsIMemoryReporter.idl nsIDebug.idl nsIInterfaceRequestor.idl nsIMemory.idl nsIProgrammingLanguage.idl nsISupports.idl nsITraceRefcnt.idl nsIWeakReference.idl nsrootidl.idl ../../dist/idl
/usr/ports/www/libxul/work/mozilla-1.9.2/config/nsinstall -R -m 644 _xpidlgen/nsIConsoleListener.h _xpidlgen/nsIConsoleMessage.h _xpidlgen/nsIConsoleService.h _xpidlgen/nsIDebug2.h _xpidlgen/nsIErrorService.h _xpidlgen/nsIException.h _xpidlgen/nsIExceptionService.h _xpidlgen/nsIVersionComparator.h _xpidlgen/nsIUUIDGenerator.h _xpidlgen/nsIMutable.h _xpidlgen/nsIMemoryReporter.h _xpidlgen/nsIDebug.h _xpidlgen/nsIInterfaceRequestor.h _xpidlgen/nsIMemory.h _xpidlgen/nsIProgrammingLanguage.h _xpidlgen/nsISupports.h _xpidlgen/nsITraceRefcnt.h _xpidlgen/nsIWeakReference.h _xpidlgen/nsrootidl.h ../../dist/include 
gmake[4]: Leaving directory `/usr/ports/www/libxul/work/mozilla-1.9.2/xpcom/base'
gmake[4]: Entering directory `/usr/ports/www/libxul/work/mozilla-1.9.2/xpcom/ds'
/usr/ports/www/libxul/work/mozilla-1.9.2/config/nsinstall -D ../../dist/idl
/usr/ports/www/libxul/work/mozilla-1.9.2/config/nsinstall -D ../../dist/idl
/usr/ports/www/libxul/work/mozilla-1.9.2/config/nsinstall -R -m 644 nsAtomService.h nsCheapSets.h nsCppSharedAllocator.h nsCRT.h nsDoubleHashtable.h nsExpirationTracker.h nsFixedSizeAllocator.h nsHashSets.h nsHashtable.h nsIByteBuffer.h nsIUnicharBuffer.h nsInt64.h nsMathUtils.h nsObserverService.h nsRecyclingAllocator.h nsStaticNameTable.h nsStaticAtom.h nsSupportsArray.h nsSupportsPrimitives.h nsTime.h nsVariant.h nsStringEnumerator.h nsHashPropertyBag.h nsWhitespaceTokenizer.h nsCommaSeparatedTokenizer.h ../../dist/include
/usr/ports/www/libxul/work/mozilla-1.9.2/config/nsinstall -R -m 644 TimeStamp.h ../../dist/include/mozilla
/usr/ports/www/libxul/work/mozilla-1.9.2/config/nsinstall -R -m 644 nsIAtom.idl nsIAtomService.idl nsICollection.idl nsIEnumerator.idl nsIINIParser.idl nsIPersistentProperties2.idl nsIProperty.idl nsIPropertyBag.idl nsIPropertyBag2.idl nsIWritablePropertyBag.idl nsIWritablePropertyBag2.idl nsIRecyclingAllocator.idl nsIVariant.idl nsISerializable.idl nsIStringEnumerator.idl nsISupportsArray.idl nsISupportsIterators.idl nsITimelineService.idl nsIArray.idl nsIHashable.idl nsIMutableArray.idl nsIObserverService.idl nsIObserver.idl nsIProperties.idl nsISimpleEnumerator.idl nsISupportsPrimitives.idl ../../dist/idl
/usr/ports/www/libxul/work/mozilla-1.9.2/config/nsinstall -R -m 644 _xpidlgen/nsIAtom.h _xpidlgen/nsIAtomService.h _xpidlgen/nsICollection.h _xpidlgen/nsIEnumerator.h _xpidlgen/nsIINIParser.h _xpidlgen/nsIPersistentProperties2.h _xpidlgen/nsIProperty.h _xpidlgen/nsIPropertyBag.h _xpidlgen/nsIPropertyBag2.h _xpidlgen/nsIWritablePropertyBag.h _xpidlgen/nsIWritablePropertyBag2.h _xpidlgen/nsIRecyclingAllocator.h _xpidlgen/nsIVariant.h _xpidlgen/nsISerializable.h _xpidlgen/nsIStringEnumerator.h _xpidlgen/nsISupportsArray.h _xpidlgen/nsISupportsIterators.h _xpidlgen/nsITimelineService.h _xpidlgen/nsIArray.h _xpidlgen/nsIHashable.h _xpidlgen/nsIMutableArray.h _xpidlgen/nsIObserverService.h _xpidlgen/nsIObserver.h _xpidlgen/nsIProperties.h _xpidlgen/nsISimpleEnumerator.h _xpidlgen/nsISupportsPrimitives.h ../../dist/include 
gmake[4]: Leaving directory `/usr/ports/www/libxul/work/mozilla-1.9.2/xpcom/ds'
gmake[4]: Entering directory `/usr/ports/www/libxul/work/mozilla-1.9.2/xpcom/io'
/usr/ports/www/libxul/work/mozilla-1.9.2/config/nsinstall -D ../../dist/idl
/usr/ports/www/libxul/work/mozilla-1.9.2/config/nsinstall -D ../../dist/idl
/usr/ports/www/libxul/work/mozilla-1.9.2/config/nsinstall -R -m 644 nsAppDirectoryServiceDefs.h nsDirectoryService.h nsEscape.h nsFastLoadService.h nsLinebreakConverter.h nsLocalFile.h nsMultiplexInputStream.h nsNativeCharsetUtils.h nsScriptableInputStream.h nsStorageStream.h nsStringStream.h nsStreamUtils.h nsWildCard.h nsLocalFileUnix.h nsDirectoryServiceDefs.h nsDirectoryServiceUtils.h ../../dist/include
/usr/ports/www/libxul/work/mozilla-1.9.2/config/nsinstall -R -m 644 nsIBinaryInputStream.idl nsIBinaryOutputStream.idl nsIDirectoryEnumerator.idl nsIFastLoadFileControl.idl nsIFastLoadService.idl nsIInputStreamTee.idl nsILocalFileWin.idl nsILineInputStream.idl nsIUnicharLineInputStream.idl nsISimpleUnicharStreamFactory.idl nsIMultiplexInputStream.idl nsIObjectInputStream.idl nsIObjectOutputStream.idl nsIPipe.idl nsISeekableStream.idl nsIStorageStream.idl nsIStringStream.idl nsIStreamBufferAccess.idl nsIAsyncInputStream.idl nsIAsyncOutputStream.idl nsIUnicharInputStream.idl nsIUnicharOutputStream.idl nsIConverterInputStream.idl nsIConverterOutputStream.idl nsIIOUtil.idl nsISafeOutputStream.idl nsIDirectoryService.idl nsIFile.idl nsILocalFile.idl nsIInputStream.idl nsIOutputStream.idl nsIScriptableInputStream.idl ../../dist/idl
/usr/ports/www/libxul/work/mozilla-1.9.2/config/nsinstall -R -m 644 _xpidlgen/nsIBinaryInputStream.h _xpidlgen/nsIBinaryOutputStream.h _xpidlgen/nsIDirectoryEnumerator.h _xpidlgen/nsIFastLoadFileControl.h _xpidlgen/nsIFastLoadService.h _xpidlgen/nsIInputStreamTee.h _xpidlgen/nsILocalFileWin.h _xpidlgen/nsILineInputStream.h _xpidlgen/nsIUnicharLineInputStream.h _xpidlgen/nsISimpleUnicharStreamFactory.h _xpidlgen/nsIMultiplexInputStream.h _xpidlgen/nsIObjectInputStream.h _xpidlgen/nsIObjectOutputStream.h _xpidlgen/nsIPipe.h _xpidlgen/nsISeekableStream.h _xpidlgen/nsIStorageStream.h _xpidlgen/nsIStringStream.h _xpidlgen/nsIStreamBufferAccess.h _xpidlgen/nsIAsyncInputStream.h _xpidlgen/nsIAsyncOutputStream.h _xpidlgen/nsIUnicharInputStream.h _xpidlgen/nsIUnicharOutputStream.h _xpidlgen/nsIConverterInputStream.h _xpidlgen/nsIConverterOutputStream.h _xpidlgen/nsIIOUtil.h _xpidlgen/nsISafeOutputStream.h _xpidlgen/nsIDirectoryService.h _xpidlgen/nsIFile.h _xpidlgen/nsILocalFile.h _xpidlgen/nsIInputStream.h _xpidlgen/nsIOutputStream.h _xpidlgen/nsIScriptableInputStream.h ../../dist/include 
gmake[4]: Leaving directory `/usr/ports/www/libxul/work/mozilla-1.9.2/xpcom/io'
gmake[4]: Entering directory `/usr/ports/www/libxul/work/mozilla-1.9.2/xpcom/components'
/usr/ports/www/libxul/work/mozilla-1.9.2/config/nsinstall -D ../../dist/idl
/usr/ports/www/libxul/work/mozilla-1.9.2/config/nsinstall -D ../../dist/idl
/usr/ports/www/libxul/work/mozilla-1.9.2/config/nsinstall -R -m 644 nsCategoryManagerUtils.h nsIServiceManagerObsolete.h nsModule.h nsObsoleteModuleLoading.h ../../dist/include
/usr/ports/www/libxul/work/mozilla-1.9.2/config/nsinstall -R -m 644 nsIModuleLoader.idl nsIComponentManagerObsolete.idl nsIClassInfo.idl nsIComponentRegistrar.idl nsIFactory.idl nsIModule.idl nsIServiceManager.idl nsIComponentManager.idl nsICategoryManager.idl ../../dist/idl
/usr/ports/www/libxul/work/mozilla-1.9.2/config/nsinstall -R -m 644 _xpidlgen/nsIModuleLoader.h _xpidlgen/nsIComponentManagerObsolete.h _xpidlgen/nsIClassInfo.h _xpidlgen/nsIComponentRegistrar.h _xpidlgen/nsIFactory.h _xpidlgen/nsIModule.h _xpidlgen/nsIServiceManager.h _xpidlgen/nsIComponentManager.h _xpidlgen/nsICategoryManager.h ../../dist/include 
gmake[4]: Leaving directory `/usr/ports/www/libxul/work/mozilla-1.9.2/xpcom/components'
gmake[4]: Entering directory `/usr/ports/www/libxul/work/mozilla-1.9.2/xpcom/threads'
/usr/ports/www/libxul/work/mozilla-1.9.2/config/nsinstall -D ../../dist/idl
/usr/ports/www/libxul/work/mozilla-1.9.2/config/nsinstall -D ../../dist/idl
/usr/ports/www/libxul/work/mozilla-1.9.2/config/nsinstall -R -m 644 nsProcess.h nsEventQueue.h nsThreadUtilsInternal.h ../../dist/include
/usr/ports/www/libxul/work/mozilla-1.9.2/config/nsinstall -R -m 644 nsIEventTarget.idl nsIThread.idl nsIThreadInternal.idl nsIThreadManager.idl nsIThreadPool.idl nsITimer.idl nsIRunnable.idl nsIEnvironment.idl nsIProcess.idl nsISupportsPriority.idl ../../dist/idl
/usr/ports/www/libxul/work/mozilla-1.9.2/config/nsinstall -R -m 644 _xpidlgen/nsIEventTarget.h _xpidlgen/nsIThread.h _xpidlgen/nsIThreadInternal.h _xpidlgen/nsIThreadManager.h _xpidlgen/nsIThreadPool.h _xpidlgen/nsITimer.h _xpidlgen/nsIRunnable.h _xpidlgen/nsIEnvironment.h _xpidlgen/nsIProcess.h _xpidlgen/nsISupportsPriority.h ../../dist/include 
gmake[4]: Leaving directory `/usr/ports/www/libxul/work/mozilla-1.9.2/xpcom/threads'
gmake[4]: Entering directory `/usr/ports/www/libxul/work/mozilla-1.9.2/xpcom/reflect'
gmake[5]: Entering directory `/usr/ports/www/libxul/work/mozilla-1.9.2/xpcom/reflect/xptinfo'
gmake[6]: Entering directory `/usr/ports/www/libxul/work/mozilla-1.9.2/xpcom/reflect/xptinfo/public'
/usr/ports/www/libxul/work/mozilla-1.9.2/config/nsinstall -D ../../../../dist/idl
/usr/ports/www/libxul/work/mozilla-1.9.2/config/nsinstall -D ../../../../dist/idl
/usr/ports/www/libxul/work/mozilla-1.9.2/config/nsinstall -R -m 644 xptinfo.h ../../../../dist/include
/usr/ports/www/libxul/work/mozilla-1.9.2/config/nsinstall -R -m 644 nsIInterfaceInfo.idl nsIInterfaceInfoManager.idl nsIXPTLoader.idl ../../../../dist/idl
/usr/ports/www/libxul/work/mozilla-1.9.2/config/nsinstall -R -m 644 _xpidlgen/nsIInterfaceInfo.h _xpidlgen/nsIInterfaceInfoManager.h _xpidlgen/nsIXPTLoader.h ../../../../dist/include 
gmake[6]: Leaving directory `/usr/ports/www/libxul/work/mozilla-1.9.2/xpcom/reflect/xptinfo/public'
gmake[6]: Entering directory `/usr/ports/www/libxul/work/mozilla-1.9.2/xpcom/reflect/xptinfo/src'
gmake[6]: Nothing to be done for `export'.
gmake[6]: Leaving directory `/usr/ports/www/libxul/work/mozilla-1.9.2/xpcom/reflect/xptinfo/src'
gmake[5]: Leaving directory `/usr/ports/www/libxul/work/mozilla-1.9.2/xpcom/reflect/xptinfo'
gmake[5]: Entering directory `/usr/ports/www/libxul/work/mozilla-1.9.2/xpcom/reflect/xptcall'
gmake[6]: Entering directory `/usr/ports/www/libxul/work/mozilla-1.9.2/xpcom/reflect/xptcall/public'
/usr/ports/www/libxul/work/mozilla-1.9.2/config/nsinstall -R -m 644 xptcall.h xptcstubsdecl.inc xptcstubsdef.inc ../../../../dist/include
gmake[6]: Leaving directory `/usr/ports/www/libxul/work/mozilla-1.9.2/xpcom/reflect/xptcall/public'
gmake[6]: Entering directory `/usr/ports/www/libxul/work/mozilla-1.9.2/xpcom/reflect/xptcall/src'
gmake[7]: Entering directory `/usr/ports/www/libxul/work/mozilla-1.9.2/xpcom/reflect/xptcall/src/md'
gmake[8]: Entering directory `/usr/ports/www/libxul/work/mozilla-1.9.2/xpcom/reflect/xptcall/src/md/unix'
gmake[8]: Nothing to be done for `export'.
gmake[8]: Leaving directory `/usr/ports/www/libxul/work/mozilla-1.9.2/xpcom/reflect/xptcall/src/md/unix'
gmake[7]: Leaving directory `/usr/ports/www/libxul/work/mozilla-1.9.2/xpcom/reflect/xptcall/src/md'
gmake[6]: Leaving directory `/usr/ports/www/libxul/work/mozilla-1.9.2/xpcom/reflect/xptcall/src'
gmake[5]: Leaving directory `/usr/ports/www/libxul/work/mozilla-1.9.2/xpcom/reflect/xptcall'
gmake[4]: Leaving directory `/usr/ports/www/libxul/work/mozilla-1.9.2/xpcom/reflect'
gmake[4]: Entering directory `/usr/ports/www/libxul/work/mozilla-1.9.2/xpcom/proxy'
gmake[5]: Entering directory `/usr/ports/www/libxul/work/mozilla-1.9.2/xpcom/proxy/public'
/usr/ports/www/libxul/work/mozilla-1.9.2/config/nsinstall -D ../../../dist/idl
/usr/ports/www/libxul/work/mozilla-1.9.2/config/nsinstall -D ../../../dist/idl
/usr/ports/www/libxul/work/mozilla-1.9.2/config/nsinstall -R -m 644 nsProxiedService.h ../../../dist/include
/usr/ports/www/libxul/work/mozilla-1.9.2/config/nsinstall -R -m 644 nsIProxyObjectManager.idl ../../../dist/idl
/usr/ports/www/libxul/work/mozilla-1.9.2/config/nsinstall -R -m 644 _xpidlgen/nsIProxyObjectManager.h ../../../dist/include 
gmake[5]: Leaving directory `/usr/ports/www/libxul/work/mozilla-1.9.2/xpcom/proxy/public'
gmake[5]: Entering directory `/usr/ports/www/libxul/work/mozilla-1.9.2/xpcom/proxy/src'
gmake[5]: Nothing to be done for `export'.
gmake[5]: Leaving directory `/usr/ports/www/libxul/work/mozilla-1.9.2/xpcom/proxy/src'
gmake[4]: Leaving directory `/usr/ports/www/libxul/work/mozilla-1.9.2/xpcom/proxy'
gmake[4]: Entering directory `/usr/ports/www/libxul/work/mozilla-1.9.2/xpcom/system'
/usr/ports/www/libxul/work/mozilla-1.9.2/config/nsinstall -D ../../dist/idl
/usr/ports/www/libxul/work/mozilla-1.9.2/config/nsinstall -D ../../dist/idl
/usr/ports/www/libxul/work/mozilla-1.9.2/config/nsinstall -R -m 644 nsIXULAppInfo.idl nsIXULRuntime.idl nsIGConfService.idl nsIGnomeVFSService.idl nsIBlocklistService.idl ../../dist/idl
/usr/ports/www/libxul/work/mozilla-1.9.2/config/nsinstall -R -m 644 _xpidlgen/nsIXULAppInfo.h _xpidlgen/nsIXULRuntime.h _xpidlgen/nsIGConfService.h _xpidlgen/nsIGnomeVFSService.h _xpidlgen/nsIBlocklistService.h ../../dist/include 
gmake[4]: Leaving directory `/usr/ports/www/libxul/work/mozilla-1.9.2/xpcom/system'
gmake[4]: Entering directory `/usr/ports/www/libxul/work/mozilla-1.9.2/xpcom/build'
/usr/local/bin/perl5.14.2 -I../../config ../../config/build-list.pl ../../config/final-link-libs xpcom_core
/usr/ports/www/libxul/work/mozilla-1.9.2/config/nsinstall -R -m 644 nsXPCOMCIDInternal.h xrecore.h nsXULAppAPI.h nsXPCOM.h nsXPCOMCID.h ../../dist/include
/usr/ports/www/libxul/work/mozilla-1.9.2/config/nsinstall -R -m 644 XPCOM.h ../../dist/include/mozilla
/usr/ports/www/libxul/work/mozilla-1.9.2/config/nsinstall -R ../../xpcom/glue/pldhash.c ../../xpcom/glue/nsArrayEnumerator.cpp ../../xpcom/glue/nsArrayUtils.cpp ../../xpcom/glue/nsCategoryCache.cpp ../../xpcom/glue/nsCOMPtr.cpp ../../xpcom/glue/nsCOMArray.cpp ../../xpcom/glue/nsCRTGlue.cpp ../../xpcom/glue/nsComponentManagerUtils.cpp ../../xpcom/glue/nsEnumeratorUtils.cpp ../../xpcom/glue/nsID.cpp ../../xpcom/glue/nsIInterfaceRequestorUtils.cpp ../../xpcom/glue/nsINIParser.cpp ../../xpcom/glue/nsISupportsImpl.cpp ../../xpcom/glue/nsMemory.cpp ../../xpcom/glue/nsWeakReference.cpp ../../xpcom/glue/nsGREGlue.cpp ../../xpcom/glue/nsVersionComparator.cpp ../../xpcom/glue/nsTHashtable.cpp ../../xpcom/glue/nsQuickSort.cpp ../../xpcom/glue/nsVoidArray.cpp ../../xpcom/glue/nsTArray.cpp ../../xpcom/glue/nsThreadUtils.cpp ../../xpcom/glue/nsTObserverArray.cpp ../../xpcom/glue/nsCycleCollectionParticipant.cpp ../../xpcom/glue/nsDeque.cpp ../../xpcom/glue/BlockingResourceBase.cpp ../../xpcom/glue/DeadlockDetector.cpp ../../xpcom/glue/nsAutoLock.cpp ../../xpcom/glue/nsGenericFactory.cpp ../../xpcom/glue/nsProxyRelease.cpp ../../xpcom/glue/nsTextFormatter.cpp .
gmake[4]: Leaving directory `/usr/ports/www/libxul/work/mozilla-1.9.2/xpcom/build'
gmake[4]: Entering directory `/usr/ports/www/libxul/work/mozilla-1.9.2/xpcom/tools'
gmake[5]: Entering directory `/usr/ports/www/libxul/work/mozilla-1.9.2/xpcom/tools/registry'
gmake[5]: Nothing to be done for `export'.
gmake[5]: Leaving directory `/usr/ports/www/libxul/work/mozilla-1.9.2/xpcom/tools/registry'
gmake[4]: Leaving directory `/usr/ports/www/libxul/work/mozilla-1.9.2/xpcom/tools'
/usr/ports/www/libxul/work/mozilla-1.9.2/config/nsinstall -R -m 644 xpcom-config.h ../dist/include
gmake[3]: Leaving directory `/usr/ports/www/libxul/work/mozilla-1.9.2/xpcom'
gmake[2]: Leaving directory `/usr/ports/www/libxul/work/mozilla-1.9.2'
gmake libs_tier_xpcom
gmake[2]: Entering directory `/usr/ports/www/libxul/work/mozilla-1.9.2'
Section [Build] not found.
libs_tier_xpcom
gmake[3]: Entering directory `/usr/ports/www/libxul/work/mozilla-1.9.2'
gmake[3]: `xpcom/Makefile' is up to date.
gmake[3]: Leaving directory `/usr/ports/www/libxul/work/mozilla-1.9.2'
gmake[3]: Entering directory `/usr/ports/www/libxul/work/mozilla-1.9.2/xpcom'
gmake[4]: Entering directory `/usr/ports/www/libxul/work/mozilla-1.9.2/xpcom/typelib'
gmake[5]: Entering directory `/usr/ports/www/libxul/work/mozilla-1.9.2/xpcom/typelib/xpt'
gmake[6]: Entering directory `/usr/ports/www/libxul/work/mozilla-1.9.2/xpcom/typelib/xpt/public'
gmake[6]: Nothing to be done for `libs'.
gmake[6]: Leaving directory `/usr/ports/www/libxul/work/mozilla-1.9.2/xpcom/typelib/xpt/public'
gmake[6]: Entering directory `/usr/ports/www/libxul/work/mozilla-1.9.2/xpcom/typelib/xpt/src'
/usr/ports/www/libxul/work/mozilla-1.9.2/config/nsinstall -R -m 644 libxpt.a ../../../../dist/lib
gmake[6]: Leaving directory `/usr/ports/www/libxul/work/mozilla-1.9.2/xpcom/typelib/xpt/src'
gmake[6]: Entering directory `/usr/ports/www/libxul/work/mozilla-1.9.2/xpcom/typelib/xpt/tools'
/usr/ports/www/libxul/work/mozilla-1.9.2/config/nsinstall -R -m 755 xpt_dump xpt_link ../../../../dist/bin
/usr/ports/www/libxul/work/mozilla-1.9.2/config/nsinstall -D ../../../../dist/sdk/bin
/usr/ports/www/libxul/work/mozilla-1.9.2/config/nsinstall -R -m 755 xpt_dump xpt_link ../../../../dist/sdk/bin
gmake[6]: Leaving directory `/usr/ports/www/libxul/work/mozilla-1.9.2/xpcom/typelib/xpt/tools'
gmake[5]: Leaving directory `/usr/ports/www/libxul/work/mozilla-1.9.2/xpcom/typelib/xpt'
gmake[5]: Entering directory `/usr/ports/www/libxul/work/mozilla-1.9.2/xpcom/typelib/xpidl'
/usr/ports/www/libxul/work/mozilla-1.9.2/config/nsinstall -R -m 755 xpidl ../../../dist/bin
/usr/ports/www/libxul/work/mozilla-1.9.2/config/nsinstall -D ../../../dist/sdk/bin
/usr/ports/www/libxul/work/mozilla-1.9.2/config/nsinstall -R -m 755 xpidl ../../../dist/sdk/bin
gmake[5]: Leaving directory `/usr/ports/www/libxul/work/mozilla-1.9.2/xpcom/typelib/xpidl'
gmake[4]: Leaving directory `/usr/ports/www/libxul/work/mozilla-1.9.2/xpcom/typelib'
gmake[4]: Entering directory `/usr/ports/www/libxul/work/mozilla-1.9.2/xpcom/string'
gmake[5]: Entering directory `/usr/ports/www/libxul/work/mozilla-1.9.2/xpcom/string/public'
gmake[5]: Nothing to be done for `libs'.
gmake[5]: Leaving directory `/usr/ports/www/libxul/work/mozilla-1.9.2/xpcom/string/public'
gmake[5]: Entering directory `/usr/ports/www/libxul/work/mozilla-1.9.2/xpcom/string/src'
gmake[5]: Nothing to be done for `libs'.
gmake[5]: Leaving directory `/usr/ports/www/libxul/work/mozilla-1.9.2/xpcom/string/src'
gmake[4]: Leaving directory `/usr/ports/www/libxul/work/mozilla-1.9.2/xpcom/string'
gmake[4]: Entering directory `/usr/ports/www/libxul/work/mozilla-1.9.2/xpcom/glue'
/usr/ports/www/libxul/work/mozilla-1.9.2/config/nsinstall -R -m 644 libxpcomglue_s.a ../../dist/lib
/usr/ports/www/libxul/work/mozilla-1.9.2/config/nsinstall -D ../../dist/sdk/lib
gmake[5]: Entering directory `/usr/ports/www/libxul/work/mozilla-1.9.2/xpcom/glue/standalone'
/usr/ports/www/libxul/work/mozilla-1.9.2/config/nsinstall -R -m 644 libxpcomglue.a ../../../dist/lib
/usr/ports/www/libxul/work/mozilla-1.9.2/config/nsinstall -D ../../../dist/sdk/lib
/usr/ports/www/libxul/work/mozilla-1.9.2/config/nsinstall -R -m 755 libxpcomglue.a ../../../dist/sdk/lib
gmake[5]: Leaving directory `/usr/ports/www/libxul/work/mozilla-1.9.2/xpcom/glue/standalone'
/usr/ports/www/libxul/work/mozilla-1.9.2/config/nsinstall -R -m 755 libxpcomglue_s.a ../../dist/sdk/lib
gmake[4]: Leaving directory `/usr/ports/www/libxul/work/mozilla-1.9.2/xpcom/glue'
gmake[4]: Entering directory `/usr/ports/www/libxul/work/mozilla-1.9.2/xpcom/base'
/usr/ports/www/libxul/work/mozilla-1.9.2/config/nsinstall -R -m 644 _xpidlgen/xpcom_base.xpt ../../dist/bin/components
gmake[4]: Leaving directory `/usr/ports/www/libxul/work/mozilla-1.9.2/xpcom/base'
gmake[4]: Entering directory `/usr/ports/www/libxul/work/mozilla-1.9.2/xpcom/ds'
/usr/ports/www/libxul/work/mozilla-1.9.2/config/nsinstall -R -m 644 _xpidlgen/xpcom_ds.xpt ../../dist/bin/components
/usr/ports/www/libxul/work/mozilla-1.9.2/config/nsinstall -R -m 644 nsINIProcessor.js ../../dist/bin/components
gmake[4]: Leaving directory `/usr/ports/www/libxul/work/mozilla-1.9.2/xpcom/ds'
gmake[4]: Entering directory `/usr/ports/www/libxul/work/mozilla-1.9.2/xpcom/io'
/usr/ports/www/libxul/work/mozilla-1.9.2/config/nsinstall -R -m 644 _xpidlgen/xpcom_io.xpt ../../dist/bin/components
gmake[4]: Leaving directory `/usr/ports/www/libxul/work/mozilla-1.9.2/xpcom/io'
gmake[4]: Entering directory `/usr/ports/www/libxul/work/mozilla-1.9.2/xpcom/components'
/usr/ports/www/libxul/work/mozilla-1.9.2/config/nsinstall -R -m 644 _xpidlgen/xpcom_components.xpt ../../dist/bin/components
gmake[4]: Leaving directory `/usr/ports/www/libxul/work/mozilla-1.9.2/xpcom/components'
gmake[4]: Entering directory `/usr/ports/www/libxul/work/mozilla-1.9.2/xpcom/threads'
/usr/ports/www/libxul/work/mozilla-1.9.2/config/nsinstall -R -m 644 _xpidlgen/xpcom_threads.xpt ../../dist/bin/components
gmake[4]: Leaving directory `/usr/ports/www/libxul/work/mozilla-1.9.2/xpcom/threads'
gmake[4]: Entering directory `/usr/ports/www/libxul/work/mozilla-1.9.2/xpcom/reflect'
gmake[5]: Entering directory `/usr/ports/www/libxul/work/mozilla-1.9.2/xpcom/reflect/xptinfo'
gmake[6]: Entering directory `/usr/ports/www/libxul/work/mozilla-1.9.2/xpcom/reflect/xptinfo/public'
/usr/ports/www/libxul/work/mozilla-1.9.2/config/nsinstall -R -m 644 _xpidlgen/xpcom_xpti.xpt ../../../../dist/bin/components
gmake[6]: Leaving directory `/usr/ports/www/libxul/work/mozilla-1.9.2/xpcom/reflect/xptinfo/public'
gmake[6]: Entering directory `/usr/ports/www/libxul/work/mozilla-1.9.2/xpcom/reflect/xptinfo/src'
gmake[6]: Nothing to be done for `libs'.
gmake[6]: Leaving directory `/usr/ports/www/libxul/work/mozilla-1.9.2/xpcom/reflect/xptinfo/src'
gmake[5]: Leaving directory `/usr/ports/www/libxul/work/mozilla-1.9.2/xpcom/reflect/xptinfo'
gmake[5]: Entering directory `/usr/ports/www/libxul/work/mozilla-1.9.2/xpcom/reflect/xptcall'
gmake[6]: Entering directory `/usr/ports/www/libxul/work/mozilla-1.9.2/xpcom/reflect/xptcall/public'
gmake[6]: Nothing to be done for `libs'.
gmake[6]: Leaving directory `/usr/ports/www/libxul/work/mozilla-1.9.2/xpcom/reflect/xptcall/public'
gmake[6]: Entering directory `/usr/ports/www/libxul/work/mozilla-1.9.2/xpcom/reflect/xptcall/src'
gmake[7]: Entering directory `/usr/ports/www/libxul/work/mozilla-1.9.2/xpcom/reflect/xptcall/src/md'
gmake[8]: Entering directory `/usr/ports/www/libxul/work/mozilla-1.9.2/xpcom/reflect/xptcall/src/md/unix'
xptcstubs_ipf64.cpp
c++ -o xptcstubs_ipf64.o -c -fvisibility=hidden -DMOZILLA_INTERNAL_API -DOSTYPE=\"FreeBSD9\" -DOSARCH=FreeBSD -DEXPORT_XPTC_API -D_IMPL_NS_COM -I./../.. -I./../../../../xptinfo/src  -I. -I. -I../../../../../../dist/include -I../../../../../../dist/include/nsprpub  -I/usr/local/include/nspr -I/usr/ports/www/libxul/work/mozilla-1.9.2/dist/include/nss   -I/usr/include   -I/usr/local/include   -fPIC  -I/usr/local/include  -I/usr/local/include -fno-rtti -fno-exceptions -Wall -Wpointer-arith -Woverloaded-virtual -Wsynth -Wno-ctor-dtor-privacy -Wno-non-virtual-dtor -Wno-invalid-offsetof -Wno-long-long -pipe -g -fno-strict-aliasing -fshort-wchar -pipe  -DDEBUG -D_DEBUG -DDEBUG_root -DTRACING -g  -I/usr/local/include  -I/usr/local/include -DMOZILLA_CLIENT -include ../../../../../../mozilla-config.h xptcstubs_ipf64.cpp
In file included from xptcstubs_ipf64.cpp:185:
../../../../../../dist/include/xptcstubsdef.inc:1: error: prototype for 'nsresult nsXPTCStubBase::Stub3(PRUint64, PRUint64, PRUint64, PRUint64, PRUint64, PRUint64, PRUint64, PRUint64)' does not match any in class 'nsXPTCStubBase'
../../../../../../dist/include/xptcstubsdef.inc:1: error: candidate is: virtual nsresult nsXPTCStubBase::Stub3()
../../../../../../dist/include/xptcstubsdef.inc:2: error: prototype for 'nsresult nsXPTCStubBase::Stub4(PRUint64, PRUint64, PRUint64, PRUint64, PRUint64, PRUint64, PRUint64, PRUint64)' does not match any in class 'nsXPTCStubBase'
../../../../../../dist/include/xptcstubsdef.inc:2: error: candidate is: virtual nsresult nsXPTCStubBase::Stub4()
../../../../../../dist/include/xptcstubsdef.inc:3: error: prototype for 'nsresult nsXPTCStubBase::Stub5(PRUint64, PRUint64, PRUint64, PRUint64, PRUint64, PRUint64, PRUint64, PRUint64)' does not match any in class 'nsXPTCStubBase'
../../../../../../dist/include/xptcstubsdef.inc:3: error: candidate is: virtual nsresult nsXPTCStubBase::Stub5()
../../../../../../dist/include/xptcstubsdef.inc:4: error: prototype for 'nsresult nsXPTCStubBase::Stub6(PRUint64, PRUint64, PRUint64, PRUint64, PRUint64, PRUint64, PRUint64, PRUint64)' does not match any in class 'nsXPTCStubBase'
../../../../../../dist/include/xptcstubsdef.inc:4: error: candidate is: virtual nsresult nsXPTCStubBase::Stub6()
../../../../../../dist/include/xptcstubsdef.inc:5: error: prototype for 'nsresult nsXPTCStubBase::Stub7(PRUint64, PRUint64, PRUint64, PRUint64, PRUint64, PRUint64, PRUint64, PRUint64)' does not match any in class 'nsXPTCStubBase'
../../../../../../dist/include/xptcstubsdef.inc:5: error: candidate is: virtual nsresult nsXPTCStubBase::Stub7()
../../../../../../dist/include/xptcstubsdef.inc:6: error: prototype for 'nsresult nsXPTCStubBase::Stub8(PRUint64, PRUint64, PRUint64, PRUint64, PRUint64, PRUint64, PRUint64, PRUint64)' does not match any in class 'nsXPTCStubBase'
../../../../../../dist/include/xptcstubsdef.inc:6: error: candidate is: virtual nsresult nsXPTCStubBase::Stub8()
../../../../../../dist/include/xptcstubsdef.inc:7: error: prototype for 'nsresult nsXPTCStubBase::Stub9(PRUint64, PRUint64, PRUint64, PRUint64, PRUint64, PRUint64, PRUint64, PRUint64)' does not match any in class 'nsXPTCStubBase'
../../../../../../dist/include/xptcstubsdef.inc:7: error: candidate is: virtual nsresult nsXPTCStubBase::Stub9()
../../../../../../dist/include/xptcstubsdef.inc:8: error: prototype for 'nsresult nsXPTCStubBase::Stub10(PRUint64, PRUint64, PRUint64, PRUint64, PRUint64, PRUint64, PRUint64, PRUint64)' does not match any in class 'nsXPTCStubBase'
../../../../../../dist/include/xptcstubsdef.inc:8: error: candidate is: virtual nsresult nsXPTCStubBase::Stub10()
../../../../../../dist/include/xptcstubsdef.inc:9: error: prototype for 'nsresult nsXPTCStubBase::Stub11(PRUint64, PRUint64, PRUint64, PRUint64, PRUint64, PRUint64, PRUint64, PRUint64)' does not match any in class 'nsXPTCStubBase'
../../../../../../dist/include/xptcstubsdef.inc:9: error: candidate is: virtual nsresult nsXPTCStubBase::Stub11()
../../../../../../dist/include/xptcstubsdef.inc:10: error: prototype for 'nsresult nsXPTCStubBase::Stub12(PRUint64, PRUint64, PRUint64, PRUint64, PRUint64, PRUint64, PRUint64, PRUint64)' does not match any in class 'nsXPTCStubBase'
../../../../../../dist/include/xptcstubsdef.inc:10: error: candidate is: virtual nsresult nsXPTCStubBase::Stub12()
../../../../../../dist/include/xptcstubsdef.inc:11: error: prototype for 'nsresult nsXPTCStubBase::Stub13(PRUint64, PRUint64, PRUint64, PRUint64, PRUint64, PRUint64, PRUint64, PRUint64)' does not match any in class 'nsXPTCStubBase'
../../../../../../dist/include/xptcstubsdef.inc:11: error: candidate is: virtual nsresult nsXPTCStubBase::Stub13()
../../../../../../dist/include/xptcstubsdef.inc:12: error: prototype for 'nsresult nsXPTCStubBase::Stub14(PRUint64, PRUint64, PRUint64, PRUint64, PRUint64, PRUint64, PRUint64, PRUint64)' does not match any in class 'nsXPTCStubBase'
../../../../../../dist/include/xptcstubsdef.inc:12: error: candidate is: virtual nsresult nsXPTCStubBase::Stub14()
../../../../../../dist/include/xptcstubsdef.inc:13: error: prototype for 'nsresult nsXPTCStubBase::Stub15(PRUint64, PRUint64, PRUint64, PRUint64, PRUint64, PRUint64, PRUint64, PRUint64)' does not match any in class 'nsXPTCStubBase'
../../../../../../dist/include/xptcstubsdef.inc:13: error: candidate is: virtual nsresult nsXPTCStubBase::Stub15()
../../../../../../dist/include/xptcstubsdef.inc:14: error: prototype for 'nsresult nsXPTCStubBase::Stub16(PRUint64, PRUint64, PRUint64, PRUint64, PRUint64, PRUint64, PRUint64, PRUint64)' does not match any in class 'nsXPTCStubBase'
../../../../../../dist/include/xptcstubsdef.inc:14: error: candidate is: virtual nsresult nsXPTCStubBase::Stub16()
../../../../../../dist/include/xptcstubsdef.inc:15: error: prototype for 'nsresult nsXPTCStubBase::Stub17(PRUint64, PRUint64, PRUint64, PRUint64, PRUint64, PRUint64, PRUint64, PRUint64)' does not match any in class 'nsXPTCStubBase'
../../../../../../dist/include/xptcstubsdef.inc:15: error: candidate is: virtual nsresult nsXPTCStubBase::Stub17()
../../../../../../dist/include/xptcstubsdef.inc:16: error: prototype for 'nsresult nsXPTCStubBase::Stub18(PRUint64, PRUint64, PRUint64, PRUint64, PRUint64, PRUint64, PRUint64, PRUint64)' does not match any in class 'nsXPTCStubBase'
../../../../../../dist/include/xptcstubsdef.inc:16: error: candidate is: virtual nsresult nsXPTCStubBase::Stub18()
../../../../../../dist/include/xptcstubsdef.inc:17: error: prototype for 'nsresult nsXPTCStubBase::Stub19(PRUint64, PRUint64, PRUint64, PRUint64, PRUint64, PRUint64, PRUint64, PRUint64)' does not match any in class 'nsXPTCStubBase'
../../../../../../dist/include/xptcstubsdef.inc:17: error: candidate is: virtual nsresult nsXPTCStubBase::Stub19()
../../../../../../dist/include/xptcstubsdef.inc:18: error: prototype for 'nsresult nsXPTCStubBase::Stub20(PRUint64, PRUint64, PRUint64, PRUint64, PRUint64, PRUint64, PRUint64, PRUint64)' does not match any in class 'nsXPTCStubBase'
../../../../../../dist/include/xptcstubsdef.inc:18: error: candidate is: virtual nsresult nsXPTCStubBase::Stub20()
../../../../../../dist/include/xptcstubsdef.inc:19: error: prototype for 'nsresult nsXPTCStubBase::Stub21(PRUint64, PRUint64, PRUint64, PRUint64, PRUint64, PRUint64, PRUint64, PRUint64)' does not match any in class 'nsXPTCStubBase'
../../../../../../dist/include/xptcstubsdef.inc:19: error: candidate is: virtual nsresult nsXPTCStubBase::Stub21()
../../../../../../dist/include/xptcstubsdef.inc:20: error: prototype for 'nsresult nsXPTCStubBase::Stub22(PRUint64, PRUint64, PRUint64, PRUint64, PRUint64, PRUint64, PRUint64, PRUint64)' does not match any in class 'nsXPTCStubBase'
../../../../../../dist/include/xptcstubsdef.inc:20: error: candidate is: virtual nsresult nsXPTCStubBase::Stub22()
../../../../../../dist/include/xptcstubsdef.inc:21: error: prototype for 'nsresult nsXPTCStubBase::Stub23(PRUint64, PRUint64, PRUint64, PRUint64, PRUint64, PRUint64, PRUint64, PRUint64)' does not match any in class 'nsXPTCStubBase'
../../../../../../dist/include/xptcstubsdef.inc:21: error: candidate is: virtual nsresult nsXPTCStubBase::Stub23()
../../../../../../dist/include/xptcstubsdef.inc:22: error: prototype for 'nsresult nsXPTCStubBase::Stub24(PRUint64, PRUint64, PRUint64, PRUint64, PRUint64, PRUint64, PRUint64, PRUint64)' does not match any in class 'nsXPTCStubBase'
../../../../../../dist/include/xptcstubsdef.inc:22: error: candidate is: virtual nsresult nsXPTCStubBase::Stub24()
../../../../../../dist/include/xptcstubsdef.inc:23: error: prototype for 'nsresult nsXPTCStubBase::Stub25(PRUint64, PRUint64, PRUint64, PRUint64, PRUint64, PRUint64, PRUint64, PRUint64)' does not match any in class 'nsXPTCStubBase'
../../../../../../dist/include/xptcstubsdef.inc:23: error: candidate is: virtual nsresult nsXPTCStubBase::Stub25()
../../../../../../dist/include/xptcstubsdef.inc:24: error: prototype for 'nsresult nsXPTCStubBase::Stub26(PRUint64, PRUint64, PRUint64, PRUint64, PRUint64, PRUint64, PRUint64, PRUint64)' does not match any in class 'nsXPTCStubBase'
../../../../../../dist/include/xptcstubsdef.inc:24: error: candidate is: virtual nsresult nsXPTCStubBase::Stub26()
../../../../../../dist/include/xptcstubsdef.inc:25: error: prototype for 'nsresult nsXPTCStubBase::Stub27(PRUint64, PRUint64, PRUint64, PRUint64, PRUint64, PRUint64, PRUint64, PRUint64)' does not match any in class 'nsXPTCStubBase'
../../../../../../dist/include/xptcstubsdef.inc:25: error: candidate is: virtual nsresult nsXPTCStubBase::Stub27()
../../../../../../dist/include/xptcstubsdef.inc:26: error: prototype for 'nsresult nsXPTCStubBase::Stub28(PRUint64, PRUint64, PRUint64, PRUint64, PRUint64, PRUint64, PRUint64, PRUint64)' does not match any in class 'nsXPTCStubBase'
../../../../../../dist/include/xptcstubsdef.inc:26: error: candidate is: virtual nsresult nsXPTCStubBase::Stub28()
../../../../../../dist/include/xptcstubsdef.inc:27: error: prototype for 'nsresult nsXPTCStubBase::Stub29(PRUint64, PRUint64, PRUint64, PRUint64, PRUint64, PRUint64, PRUint64, PRUint64)' does not match any in class 'nsXPTCStubBase'
../../../../../../dist/include/xptcstubsdef.inc:27: error: candidate is: virtual nsresult nsXPTCStubBase::Stub29()
../../../../../../dist/include/xptcstubsdef.inc:28: error: prototype for 'nsresult nsXPTCStubBase::Stub30(PRUint64, PRUint64, PRUint64, PRUint64, PRUint64, PRUint64, PRUint64, PRUint64)' does not match any in class 'nsXPTCStubBase'
../../../../../../dist/include/xptcstubsdef.inc:28: error: candidate is: virtual nsresult nsXPTCStubBase::Stub30()
../../../../../../dist/include/xptcstubsdef.inc:29: error: prototype for 'nsresult nsXPTCStubBase::Stub31(PRUint64, PRUint64, PRUint64, PRUint64, PRUint64, PRUint64, PRUint64, PRUint64)' does not match any in class 'nsXPTCStubBase'
../../../../../../dist/include/xptcstubsdef.inc:29: error: candidate is: virtual nsresult nsXPTCStubBase::Stub31()
../../../../../../dist/include/xptcstubsdef.inc:30: error: prototype for 'nsresult nsXPTCStubBase::Stub32(PRUint64, PRUint64, PRUint64, PRUint64, PRUint64, PRUint64, PRUint64, PRUint64)' does not match any in class 'nsXPTCStubBase'
../../../../../../dist/include/xptcstubsdef.inc:30: error: candidate is: virtual nsresult nsXPTCStubBase::Stub32()
../../../../../../dist/include/xptcstubsdef.inc:31: error: prototype for 'nsresult nsXPTCStubBase::Stub33(PRUint64, PRUint64, PRUint64, PRUint64, PRUint64, PRUint64, PRUint64, PRUint64)' does not match any in class 'nsXPTCStubBase'
../../../../../../dist/include/xptcstubsdef.inc:31: error: candidate is: virtual nsresult nsXPTCStubBase::Stub33()
../../../../../../dist/include/xptcstubsdef.inc:32: error: prototype for 'nsresult nsXPTCStubBase::Stub34(PRUint64, PRUint64, PRUint64, PRUint64, PRUint64, PRUint64, PRUint64, PRUint64)' does not match any in class 'nsXPTCStubBase'
../../../../../../dist/include/xptcstubsdef.inc:32: error: candidate is: virtual nsresult nsXPTCStubBase::Stub34()
../../../../../../dist/include/xptcstubsdef.inc:33: error: prototype for 'nsresult nsXPTCStubBase::Stub35(PRUint64, PRUint64, PRUint64, PRUint64, PRUint64, PRUint64, PRUint64, PRUint64)' does not match any in class 'nsXPTCStubBase'
../../../../../../dist/include/xptcstubsdef.inc:33: error: candidate is: virtual nsresult nsXPTCStubBase::Stub35()
../../../../../../dist/include/xptcstubsdef.inc:34: error: prototype for 'nsresult nsXPTCStubBase::Stub36(PRUint64, PRUint64, PRUint64, PRUint64, PRUint64, PRUint64, PRUint64, PRUint64)' does not match any in class 'nsXPTCStubBase'
../../../../../../dist/include/xptcstubsdef.inc:34: error: candidate is: virtual nsresult nsXPTCStubBase::Stub36()
../../../../../../dist/include/xptcstubsdef.inc:35: error: prototype for 'nsresult nsXPTCStubBase::Stub37(PRUint64, PRUint64, PRUint64, PRUint64, PRUint64, PRUint64, PRUint64, PRUint64)' does not match any in class 'nsXPTCStubBase'
../../../../../../dist/include/xptcstubsdef.inc:35: error: candidate is: virtual nsresult nsXPTCStubBase::Stub37()
../../../../../../dist/include/xptcstubsdef.inc:36: error: prototype for 'nsresult nsXPTCStubBase::Stub38(PRUint64, PRUint64, PRUint64, PRUint64, PRUint64, PRUint64, PRUint64, PRUint64)' does not match any in class 'nsXPTCStubBase'
../../../../../../dist/include/xptcstubsdef.inc:36: error: candidate is: virtual nsresult nsXPTCStubBase::Stub38()
../../../../../../dist/include/xptcstubsdef.inc:37: error: prototype for 'nsresult nsXPTCStubBase::Stub39(PRUint64, PRUint64, PRUint64, PRUint64, PRUint64, PRUint64, PRUint64, PRUint64)' does not match any in class 'nsXPTCStubBase'
../../../../../../dist/include/xptcstubsdef.inc:37: error: candidate is: virtual nsresult nsXPTCStubBase::Stub39()
../../../../../../dist/include/xptcstubsdef.inc:38: error: prototype for 'nsresult nsXPTCStubBase::Stub40(PRUint64, PRUint64, PRUint64, PRUint64, PRUint64, PRUint64, PRUint64, PRUint64)' does not match any in class 'nsXPTCStubBase'
../../../../../../dist/include/xptcstubsdef.inc:38: error: candidate is: virtual nsresult nsXPTCStubBase::Stub40()
../../../../../../dist/include/xptcstubsdef.inc:39: error: prototype for 'nsresult nsXPTCStubBase::Stub41(PRUint64, PRUint64, PRUint64, PRUint64, PRUint64, PRUint64, PRUint64, PRUint64)' does not match any in class 'nsXPTCStubBase'
../../../../../../dist/include/xptcstubsdef.inc:39: error: candidate is: virtual nsresult nsXPTCStubBase::Stub41()
../../../../../../dist/include/xptcstubsdef.inc:40: error: prototype for 'nsresult nsXPTCStubBase::Stub42(PRUint64, PRUint64, PRUint64, PRUint64, PRUint64, PRUint64, PRUint64, PRUint64)' does not match any in class 'nsXPTCStubBase'
../../../../../../dist/include/xptcstubsdef.inc:40: error: candidate is: virtual nsresult nsXPTCStubBase::Stub42()
../../../../../../dist/include/xptcstubsdef.inc:41: error: prototype for 'nsresult nsXPTCStubBase::Stub43(PRUint64, PRUint64, PRUint64, PRUint64, PRUint64, PRUint64, PRUint64, PRUint64)' does not match any in class 'nsXPTCStubBase'
../../../../../../dist/include/xptcstubsdef.inc:41: error: candidate is: virtual nsresult nsXPTCStubBase::Stub43()
../../../../../../dist/include/xptcstubsdef.inc:42: error: prototype for 'nsresult nsXPTCStubBase::Stub44(PRUint64, PRUint64, PRUint64, PRUint64, PRUint64, PRUint64, PRUint64, PRUint64)' does not match any in class 'nsXPTCStubBase'
../../../../../../dist/include/xptcstubsdef.inc:42: error: candidate is: virtual nsresult nsXPTCStubBase::Stub44()
../../../../../../dist/include/xptcstubsdef.inc:43: error: prototype for 'nsresult nsXPTCStubBase::Stub45(PRUint64, PRUint64, PRUint64, PRUint64, PRUint64, PRUint64, PRUint64, PRUint64)' does not match any in class 'nsXPTCStubBase'
../../../../../../dist/include/xptcstubsdef.inc:43: error: candidate is: virtual nsresult nsXPTCStubBase::Stub45()
../../../../../../dist/include/xptcstubsdef.inc:44: error: prototype for 'nsresult nsXPTCStubBase::Stub46(PRUint64, PRUint64, PRUint64, PRUint64, PRUint64, PRUint64, PRUint64, PRUint64)' does not match any in class 'nsXPTCStubBase'
../../../../../../dist/include/xptcstubsdef.inc:44: error: candidate is: virtual nsresult nsXPTCStubBase::Stub46()
../../../../../../dist/include/xptcstubsdef.inc:45: error: prototype for 'nsresult nsXPTCStubBase::Stub47(PRUint64, PRUint64, PRUint64, PRUint64, PRUint64, PRUint64, PRUint64, PRUint64)' does not match any in class 'nsXPTCStubBase'
../../../../../../dist/include/xptcstubsdef.inc:45: error: candidate is: virtual nsresult nsXPTCStubBase::Stub47()
../../../../../../dist/include/xptcstubsdef.inc:46: error: prototype for 'nsresult nsXPTCStubBase::Stub48(PRUint64, PRUint64, PRUint64, PRUint64, PRUint64, PRUint64, PRUint64, PRUint64)' does not match any in class 'nsXPTCStubBase'
../../../../../../dist/include/xptcstubsdef.inc:46: error: candidate is: virtual nsresult nsXPTCStubBase::Stub48()
../../../../../../dist/include/xptcstubsdef.inc:47: error: prototype for 'nsresult nsXPTCStubBase::Stub49(PRUint64, PRUint64, PRUint64, PRUint64, PRUint64, PRUint64, PRUint64, PRUint64)' does not match any in class 'nsXPTCStubBase'
../../../../../../dist/include/xptcstubsdef.inc:47: error: candidate is: virtual nsresult nsXPTCStubBase::Stub49()
../../../../../../dist/include/xptcstubsdef.inc:48: error: prototype for 'nsresult nsXPTCStubBase::Stub50(PRUint64, PRUint64, PRUint64, PRUint64, PRUint64, PRUint64, PRUint64, PRUint64)' does not match any in class 'nsXPTCStubBase'
../../../../../../dist/include/xptcstubsdef.inc:48: error: candidate is: virtual nsresult nsXPTCStubBase::Stub50()
../../../../../../dist/include/xptcstubsdef.inc:49: error: prototype for 'nsresult nsXPTCStubBase::Stub51(PRUint64, PRUint64, PRUint64, PRUint64, PRUint64, PRUint64, PRUint64, PRUint64)' does not match any in class 'nsXPTCStubBase'
../../../../../../dist/include/xptcstubsdef.inc:49: error: candidate is: virtual nsresult nsXPTCStubBase::Stub51()
../../../../../../dist/include/xptcstubsdef.inc:50: error: prototype for 'nsresult nsXPTCStubBase::Stub52(PRUint64, PRUint64, PRUint64, PRUint64, PRUint64, PRUint64, PRUint64, PRUint64)' does not match any in class 'nsXPTCStubBase'
../../../../../../dist/include/xptcstubsdef.inc:50: error: candidate is: virtual nsresult nsXPTCStubBase::Stub52()
../../../../../../dist/include/xptcstubsdef.inc:51: error: prototype for 'nsresult nsXPTCStubBase::Stub53(PRUint64, PRUint64, PRUint64, PRUint64, PRUint64, PRUint64, PRUint64, PRUint64)' does not match any in class 'nsXPTCStubBase'
../../../../../../dist/include/xptcstubsdef.inc:51: error: candidate is: virtual nsresult nsXPTCStubBase::Stub53()
../../../../../../dist/include/xptcstubsdef.inc:52: error: prototype for 'nsresult nsXPTCStubBase::Stub54(PRUint64, PRUint64, PRUint64, PRUint64, PRUint64, PRUint64, PRUint64, PRUint64)' does not match any in class 'nsXPTCStubBase'
../../../../../../dist/include/xptcstubsdef.inc:52: error: candidate is: virtual nsresult nsXPTCStubBase::Stub54()
../../../../../../dist/include/xptcstubsdef.inc:53: error: prototype for 'nsresult nsXPTCStubBase::Stub55(PRUint64, PRUint64, PRUint64, PRUint64, PRUint64, PRUint64, PRUint64, PRUint64)' does not match any in class 'nsXPTCStubBase'
../../../../../../dist/include/xptcstubsdef.inc:53: error: candidate is: virtual nsresult nsXPTCStubBase::Stub55()
../../../../../../dist/include/xptcstubsdef.inc:54: error: prototype for 'nsresult nsXPTCStubBase::Stub56(PRUint64, PRUint64, PRUint64, PRUint64, PRUint64, PRUint64, PRUint64, PRUint64)' does not match any in class 'nsXPTCStubBase'
../../../../../../dist/include/xptcstubsdef.inc:54: error: candidate is: virtual nsresult nsXPTCStubBase::Stub56()
../../../../../../dist/include/xptcstubsdef.inc:55: error: prototype for 'nsresult nsXPTCStubBase::Stub57(PRUint64, PRUint64, PRUint64, PRUint64, PRUint64, PRUint64, PRUint64, PRUint64)' does not match any in class 'nsXPTCStubBase'
../../../../../../dist/include/xptcstubsdef.inc:55: error: candidate is: virtual nsresult nsXPTCStubBase::Stub57()
../../../../../../dist/include/xptcstubsdef.inc:56: error: prototype for 'nsresult nsXPTCStubBase::Stub58(PRUint64, PRUint64, PRUint64, PRUint64, PRUint64, PRUint64, PRUint64, PRUint64)' does not match any in class 'nsXPTCStubBase'
../../../../../../dist/include/xptcstubsdef.inc:56: error: candidate is: virtual nsresult nsXPTCStubBase::Stub58()
../../../../../../dist/include/xptcstubsdef.inc:57: error: prototype for 'nsresult nsXPTCStubBase::Stub59(PRUint64, PRUint64, PRUint64, PRUint64, PRUint64, PRUint64, PRUint64, PRUint64)' does not match any in class 'nsXPTCStubBase'
../../../../../../dist/include/xptcstubsdef.inc:57: error: candidate is: virtual nsresult nsXPTCStubBase::Stub59()
../../../../../../dist/include/xptcstubsdef.inc:58: error: prototype for 'nsresult nsXPTCStubBase::Stub60(PRUint64, PRUint64, PRUint64, PRUint64, PRUint64, PRUint64, PRUint64, PRUint64)' does not match any in class 'nsXPTCStubBase'
../../../../../../dist/include/xptcstubsdef.inc:58: error: candidate is: virtual nsresult nsXPTCStubBase::Stub60()
../../../../../../dist/include/xptcstubsdef.inc:59: error: prototype for 'nsresult nsXPTCStubBase::Stub61(PRUint64, PRUint64, PRUint64, PRUint64, PRUint64, PRUint64, PRUint64, PRUint64)' does not match any in class 'nsXPTCStubBase'
../../../../../../dist/include/xptcstubsdef.inc:59: error: candidate is: virtual nsresult nsXPTCStubBase::Stub61()
../../../../../../dist/include/xptcstubsdef.inc:60: error: prototype for 'nsresult nsXPTCStubBase::Stub62(PRUint64, PRUint64, PRUint64, PRUint64, PRUint64, PRUint64, PRUint64, PRUint64)' does not match any in class 'nsXPTCStubBase'
../../../../../../dist/include/xptcstubsdef.inc:60: error: candidate is: virtual nsresult nsXPTCStubBase::Stub62()
../../../../../../dist/include/xptcstubsdef.inc:61: error: prototype for 'nsresult nsXPTCStubBase::Stub63(PRUint64, PRUint64, PRUint64, PRUint64, PRUint64, PRUint64, PRUint64, PRUint64)' does not match any in class 'nsXPTCStubBase'
../../../../../../dist/include/xptcstubsdef.inc:61: error: candidate is: virtual nsresult nsXPTCStubBase::Stub63()
../../../../../../dist/include/xptcstubsdef.inc:62: error: prototype for 'nsresult nsXPTCStubBase::Stub64(PRUint64, PRUint64, PRUint64, PRUint64, PRUint64, PRUint64, PRUint64, PRUint64)' does not match any in class 'nsXPTCStubBase'
../../../../../../dist/include/xptcstubsdef.inc:62: error: candidate is: virtual nsresult nsXPTCStubBase::Stub64()
../../../../../../dist/include/xptcstubsdef.inc:63: error: prototype for 'nsresult nsXPTCStubBase::Stub65(PRUint64, PRUint64, PRUint64, PRUint64, PRUint64, PRUint64, PRUint64, PRUint64)' does not match any in class 'nsXPTCStubBase'
../../../../../../dist/include/xptcstubsdef.inc:63: error: candidate is: virtual nsresult nsXPTCStubBase::Stub65()
../../../../../../dist/include/xptcstubsdef.inc:64: error: prototype for 'nsresult nsXPTCStubBase::Stub66(PRUint64, PRUint64, PRUint64, PRUint64, PRUint64, PRUint64, PRUint64, PRUint64)' does not match any in class 'nsXPTCStubBase'
../../../../../../dist/include/xptcstubsdef.inc:64: error: candidate is: virtual nsresult nsXPTCStubBase::Stub66()
../../../../../../dist/include/xptcstubsdef.inc:65: error: prototype for 'nsresult nsXPTCStubBase::Stub67(PRUint64, PRUint64, PRUint64, PRUint64, PRUint64, PRUint64, PRUint64, PRUint64)' does not match any in class 'nsXPTCStubBase'
../../../../../../dist/include/xptcstubsdef.inc:65: error: candidate is: virtual nsresult nsXPTCStubBase::Stub67()
../../../../../../dist/include/xptcstubsdef.inc:66: error: prototype for 'nsresult nsXPTCStubBase::Stub68(PRUint64, PRUint64, PRUint64, PRUint64, PRUint64, PRUint64, PRUint64, PRUint64)' does not match any in class 'nsXPTCStubBase'
../../../../../../dist/include/xptcstubsdef.inc:66: error: candidate is: virtual nsresult nsXPTCStubBase::Stub68()
../../../../../../dist/include/xptcstubsdef.inc:67: error: prototype for 'nsresult nsXPTCStubBase::Stub69(PRUint64, PRUint64, PRUint64, PRUint64, PRUint64, PRUint64, PRUint64, PRUint64)' does not match any in class 'nsXPTCStubBase'
../../../../../../dist/include/xptcstubsdef.inc:67: error: candidate is: virtual nsresult nsXPTCStubBase::Stub69()
../../../../../../dist/include/xptcstubsdef.inc:68: error: prototype for 'nsresult nsXPTCStubBase::Stub70(PRUint64, PRUint64, PRUint64, PRUint64, PRUint64, PRUint64, PRUint64, PRUint64)' does not match any in class 'nsXPTCStubBase'
../../../../../../dist/include/xptcstubsdef.inc:68: error: candidate is: virtual nsresult nsXPTCStubBase::Stub70()
../../../../../../dist/include/xptcstubsdef.inc:69: error: prototype for 'nsresult nsXPTCStubBase::Stub71(PRUint64, PRUint64, PRUint64, PRUint64, PRUint64, PRUint64, PRUint64, PRUint64)' does not match any in class 'nsXPTCStubBase'
../../../../../../dist/include/xptcstubsdef.inc:69: error: candidate is: virtual nsresult nsXPTCStubBase::Stub71()
../../../../../../dist/include/xptcstubsdef.inc:70: error: prototype for 'nsresult nsXPTCStubBase::Stub72(PRUint64, PRUint64, PRUint64, PRUint64, PRUint64, PRUint64, PRUint64, PRUint64)' does not match any in class 'nsXPTCStubBase'
../../../../../../dist/include/xptcstubsdef.inc:70: error: candidate is: virtual nsresult nsXPTCStubBase::Stub72()
../../../../../../dist/include/xptcstubsdef.inc:71: error: prototype for 'nsresult nsXPTCStubBase::Stub73(PRUint64, PRUint64, PRUint64, PRUint64, PRUint64, PRUint64, PRUint64, PRUint64)' does not match any in class 'nsXPTCStubBase'
../../../../../../dist/include/xptcstubsdef.inc:71: error: candidate is: virtual nsresult nsXPTCStubBase::Stub73()
../../../../../../dist/include/xptcstubsdef.inc:72: error: prototype for 'nsresult nsXPTCStubBase::Stub74(PRUint64, PRUint64, PRUint64, PRUint64, PRUint64, PRUint64, PRUint64, PRUint64)' does not match any in class 'nsXPTCStubBase'
../../../../../../dist/include/xptcstubsdef.inc:72: error: candidate is: virtual nsresult nsXPTCStubBase::Stub74()
../../../../../../dist/include/xptcstubsdef.inc:73: error: prototype for 'nsresult nsXPTCStubBase::Stub75(PRUint64, PRUint64, PRUint64, PRUint64, PRUint64, PRUint64, PRUint64, PRUint64)' does not match any in class 'nsXPTCStubBase'
../../../../../../dist/include/xptcstubsdef.inc:73: error: candidate is: virtual nsresult nsXPTCStubBase::Stub75()
../../../../../../dist/include/xptcstubsdef.inc:74: error: prototype for 'nsresult nsXPTCStubBase::Stub76(PRUint64, PRUint64, PRUint64, PRUint64, PRUint64, PRUint64, PRUint64, PRUint64)' does not match any in class 'nsXPTCStubBase'
../../../../../../dist/include/xptcstubsdef.inc:74: error: candidate is: virtual nsresult nsXPTCStubBase::Stub76()
../../../../../../dist/include/xptcstubsdef.inc:75: error: prototype for 'nsresult nsXPTCStubBase::Stub77(PRUint64, PRUint64, PRUint64, PRUint64, PRUint64, PRUint64, PRUint64, PRUint64)' does not match any in class 'nsXPTCStubBase'
../../../../../../dist/include/xptcstubsdef.inc:75: error: candidate is: virtual nsresult nsXPTCStubBase::Stub77()
../../../../../../dist/include/xptcstubsdef.inc:76: error: prototype for 'nsresult nsXPTCStubBase::Stub78(PRUint64, PRUint64, PRUint64, PRUint64, PRUint64, PRUint64, PRUint64, PRUint64)' does not match any in class 'nsXPTCStubBase'
../../../../../../dist/include/xptcstubsdef.inc:76: error: candidate is: virtual nsresult nsXPTCStubBase::Stub78()
../../../../../../dist/include/xptcstubsdef.inc:77: error: prototype for 'nsresult nsXPTCStubBase::Stub79(PRUint64, PRUint64, PRUint64, PRUint64, PRUint64, PRUint64, PRUint64, PRUint64)' does not match any in class 'nsXPTCStubBase'
../../../../../../dist/include/xptcstubsdef.inc:77: error: candidate is: virtual nsresult nsXPTCStubBase::Stub79()
../../../../../../dist/include/xptcstubsdef.inc:78: error: prototype for 'nsresult nsXPTCStubBase::Stub80(PRUint64, PRUint64, PRUint64, PRUint64, PRUint64, PRUint64, PRUint64, PRUint64)' does not match any in class 'nsXPTCStubBase'
../../../../../../dist/include/xptcstubsdef.inc:78: error: candidate is: virtual nsresult nsXPTCStubBase::Stub80()
../../../../../../dist/include/xptcstubsdef.inc:79: error: prototype for 'nsresult nsXPTCStubBase::Stub81(PRUint64, PRUint64, PRUint64, PRUint64, PRUint64, PRUint64, PRUint64, PRUint64)' does not match any in class 'nsXPTCStubBase'
../../../../../../dist/include/xptcstubsdef.inc:79: error: candidate is: virtual nsresult nsXPTCStubBase::Stub81()
../../../../../../dist/include/xptcstubsdef.inc:80: error: prototype for 'nsresult nsXPTCStubBase::Stub82(PRUint64, PRUint64, PRUint64, PRUint64, PRUint64, PRUint64, PRUint64, PRUint64)' does not match any in class 'nsXPTCStubBase'
../../../../../../dist/include/xptcstubsdef.inc:80: error: candidate is: virtual nsresult nsXPTCStubBase::Stub82()
../../../../../../dist/include/xptcstubsdef.inc:81: error: prototype for 'nsresult nsXPTCStubBase::Stub83(PRUint64, PRUint64, PRUint64, PRUint64, PRUint64, PRUint64, PRUint64, PRUint64)' does not match any in class 'nsXPTCStubBase'
../../../../../../dist/include/xptcstubsdef.inc:81: error: candidate is: virtual nsresult nsXPTCStubBase::Stub83()
../../../../../../dist/include/xptcstubsdef.inc:82: error: prototype for 'nsresult nsXPTCStubBase::Stub84(PRUint64, PRUint64, PRUint64, PRUint64, PRUint64, PRUint64, PRUint64, PRUint64)' does not match any in class 'nsXPTCStubBase'
../../../../../../dist/include/xptcstubsdef.inc:82: error: candidate is: virtual nsresult nsXPTCStubBase::Stub84()
../../../../../../dist/include/xptcstubsdef.inc:83: error: prototype for 'nsresult nsXPTCStubBase::Stub85(PRUint64, PRUint64, PRUint64, PRUint64, PRUint64, PRUint64, PRUint64, PRUint64)' does not match any in class 'nsXPTCStubBase'
../../../../../../dist/include/xptcstubsdef.inc:83: error: candidate is: virtual nsresult nsXPTCStubBase::Stub85()
../../../../../../dist/include/xptcstubsdef.inc:84: error: prototype for 'nsresult nsXPTCStubBase::Stub86(PRUint64, PRUint64, PRUint64, PRUint64, PRUint64, PRUint64, PRUint64, PRUint64)' does not match any in class 'nsXPTCStubBase'
../../../../../../dist/include/xptcstubsdef.inc:84: error: candidate is: virtual nsresult nsXPTCStubBase::Stub86()
../../../../../../dist/include/xptcstubsdef.inc:85: error: prototype for 'nsresult nsXPTCStubBase::Stub87(PRUint64, PRUint64, PRUint64, PRUint64, PRUint64, PRUint64, PRUint64, PRUint64)' does not match any in class 'nsXPTCStubBase'
../../../../../../dist/include/xptcstubsdef.inc:85: error: candidate is: virtual nsresult nsXPTCStubBase::Stub87()
../../../../../../dist/include/xptcstubsdef.inc:86: error: prototype for 'nsresult nsXPTCStubBase::Stub88(PRUint64, PRUint64, PRUint64, PRUint64, PRUint64, PRUint64, PRUint64, PRUint64)' does not match any in class 'nsXPTCStubBase'
../../../../../../dist/include/xptcstubsdef.inc:86: error: candidate is: virtual nsresult nsXPTCStubBase::Stub88()
../../../../../../dist/include/xptcstubsdef.inc:87: error: prototype for 'nsresult nsXPTCStubBase::Stub89(PRUint64, PRUint64, PRUint64, PRUint64, PRUint64, PRUint64, PRUint64, PRUint64)' does not match any in class 'nsXPTCStubBase'
../../../../../../dist/include/xptcstubsdef.inc:87: error: candidate is: virtual nsresult nsXPTCStubBase::Stub89()
../../../../../../dist/include/xptcstubsdef.inc:88: error: prototype for 'nsresult nsXPTCStubBase::Stub90(PRUint64, PRUint64, PRUint64, PRUint64, PRUint64, PRUint64, PRUint64, PRUint64)' does not match any in class 'nsXPTCStubBase'
../../../../../../dist/include/xptcstubsdef.inc:88: error: candidate is: virtual nsresult nsXPTCStubBase::Stub90()
../../../../../../dist/include/xptcstubsdef.inc:89: error: prototype for 'nsresult nsXPTCStubBase::Stub91(PRUint64, PRUint64, PRUint64, PRUint64, PRUint64, PRUint64, PRUint64, PRUint64)' does not match any in class 'nsXPTCStubBase'
../../../../../../dist/include/xptcstubsdef.inc:89: error: candidate is: virtual nsresult nsXPTCStubBase::Stub91()
../../../../../../dist/include/xptcstubsdef.inc:90: error: prototype for 'nsresult nsXPTCStubBase::Stub92(PRUint64, PRUint64, PRUint64, PRUint64, PRUint64, PRUint64, PRUint64, PRUint64)' does not match any in class 'nsXPTCStubBase'
../../../../../../dist/include/xptcstubsdef.inc:90: error: candidate is: virtual nsresult nsXPTCStubBase::Stub92()
../../../../../../dist/include/xptcstubsdef.inc:91: error: prototype for 'nsresult nsXPTCStubBase::Stub93(PRUint64, PRUint64, PRUint64, PRUint64, PRUint64, PRUint64, PRUint64, PRUint64)' does not match any in class 'nsXPTCStubBase'
../../../../../../dist/include/xptcstubsdef.inc:91: error: candidate is: virtual nsresult nsXPTCStubBase::Stub93()
../../../../../../dist/include/xptcstubsdef.inc:92: error: prototype for 'nsresult nsXPTCStubBase::Stub94(PRUint64, PRUint64, PRUint64, PRUint64, PRUint64, PRUint64, PRUint64, PRUint64)' does not match any in class 'nsXPTCStubBase'
../../../../../../dist/include/xptcstubsdef.inc:92: error: candidate is: virtual nsresult nsXPTCStubBase::Stub94()
../../../../../../dist/include/xptcstubsdef.inc:93: error: prototype for 'nsresult nsXPTCStubBase::Stub95(PRUint64, PRUint64, PRUint64, PRUint64, PRUint64, PRUint64, PRUint64, PRUint64)' does not match any in class 'nsXPTCStubBase'
../../../../../../dist/include/xptcstubsdef.inc:93: error: candidate is: virtual nsresult nsXPTCStubBase::Stub95()
../../../../../../dist/include/xptcstubsdef.inc:94: error: prototype for 'nsresult nsXPTCStubBase::Stub96(PRUint64, PRUint64, PRUint64, PRUint64, PRUint64, PRUint64, PRUint64, PRUint64)' does not match any in class 'nsXPTCStubBase'
../../../../../../dist/include/xptcstubsdef.inc:94: error: candidate is: virtual nsresult nsXPTCStubBase::Stub96()
../../../../../../dist/include/xptcstubsdef.inc:95: error: prototype for 'nsresult nsXPTCStubBase::Stub97(PRUint64, PRUint64, PRUint64, PRUint64, PRUint64, PRUint64, PRUint64, PRUint64)' does not match any in class 'nsXPTCStubBase'
../../../../../../dist/include/xptcstubsdef.inc:95: error: candidate is: virtual nsresult nsXPTCStubBase::Stub97()
../../../../../../dist/include/xptcstubsdef.inc:96: error: prototype for 'nsresult nsXPTCStubBase::Stub98(PRUint64, PRUint64, PRUint64, PRUint64, PRUint64, PRUint64, PRUint64, PRUint64)' does not match any in class 'nsXPTCStubBase'
../../../../../../dist/include/xptcstubsdef.inc:96: error: candidate is: virtual nsresult nsXPTCStubBase::Stub98()
../../../../../../dist/include/xptcstubsdef.inc:97: error: prototype for 'nsresult nsXPTCStubBase::Stub99(PRUint64, PRUint64, PRUint64, PRUint64, PRUint64, PRUint64, PRUint64, PRUint64)' does not match any in class 'nsXPTCStubBase'
../../../../../../dist/include/xptcstubsdef.inc:97: error: candidate is: virtual nsresult nsXPTCStubBase::Stub99()
../../../../../../dist/include/xptcstubsdef.inc:98: error: prototype for 'nsresult nsXPTCStubBase::Stub100(PRUint64, PRUint64, PRUint64, PRUint64, PRUint64, PRUint64, PRUint64, PRUint64)' does not match any in class 'nsXPTCStubBase'
../../../../../../dist/include/xptcstubsdef.inc:98: error: candidate is: virtual nsresult nsXPTCStubBase::Stub100()
../../../../../../dist/include/xptcstubsdef.inc:99: error: prototype for 'nsresult nsXPTCStubBase::Stub101(PRUint64, PRUint64, PRUint64, PRUint64, PRUint64, PRUint64, PRUint64, PRUint64)' does not match any in class 'nsXPTCStubBase'
../../../../../../dist/include/xptcstubsdef.inc:99: error: candidate is: virtual nsresult nsXPTCStubBase::Stub101()
../../../../../../dist/include/xptcstubsdef.inc:100: error: prototype for 'nsresult nsXPTCStubBase::Stub102(PRUint64, PRUint64, PRUint64, PRUint64, PRUint64, PRUint64, PRUint64, PRUint64)' does not match any in class 'nsXPTCStubBase'
../../../../../../dist/include/xptcstubsdef.inc:100: error: candidate is: virtual nsresult nsXPTCStubBase::Stub102()
../../../../../../dist/include/xptcstubsdef.inc:101: error: prototype for 'nsresult nsXPTCStubBase::Stub103(PRUint64, PRUint64, PRUint64, PRUint64, PRUint64, PRUint64, PRUint64, PRUint64)' does not match any in class 'nsXPTCStubBase'
../../../../../../dist/include/xptcstubsdef.inc:101: error: candidate is: virtual nsresult nsXPTCStubBase::Stub103()
../../../../../../dist/include/xptcstubsdef.inc:102: error: prototype for 'nsresult nsXPTCStubBase::Stub104(PRUint64, PRUint64, PRUint64, PRUint64, PRUint64, PRUint64, PRUint64, PRUint64)' does not match any in class 'nsXPTCStubBase'
../../../../../../dist/include/xptcstubsdef.inc:102: error: candidate is: virtual nsresult nsXPTCStubBase::Stub104()
../../../../../../dist/include/xptcstubsdef.inc:103: error: prototype for 'nsresult nsXPTCStubBase::Stub105(PRUint64, PRUint64, PRUint64, PRUint64, PRUint64, PRUint64, PRUint64, PRUint64)' does not match any in class 'nsXPTCStubBase'
../../../../../../dist/include/xptcstubsdef.inc:103: error: candidate is: virtual nsresult nsXPTCStubBase::Stub105()
../../../../../../dist/include/xptcstubsdef.inc:104: error: prototype for 'nsresult nsXPTCStubBase::Stub106(PRUint64, PRUint64, PRUint64, PRUint64, PRUint64, PRUint64, PRUint64, PRUint64)' does not match any in class 'nsXPTCStubBase'
../../../../../../dist/include/xptcstubsdef.inc:104: error: candidate is: virtual nsresult nsXPTCStubBase::Stub106()
../../../../../../dist/include/xptcstubsdef.inc:105: error: prototype for 'nsresult nsXPTCStubBase::Stub107(PRUint64, PRUint64, PRUint64, PRUint64, PRUint64, PRUint64, PRUint64, PRUint64)' does not match any in class 'nsXPTCStubBase'
../../../../../../dist/include/xptcstubsdef.inc:105: error: candidate is: virtual nsresult nsXPTCStubBase::Stub107()
../../../../../../dist/include/xptcstubsdef.inc:106: error: prototype for 'nsresult nsXPTCStubBase::Stub108(PRUint64, PRUint64, PRUint64, PRUint64, PRUint64, PRUint64, PRUint64, PRUint64)' does not match any in class 'nsXPTCStubBase'
../../../../../../dist/include/xptcstubsdef.inc:106: error: candidate is: virtual nsresult nsXPTCStubBase::Stub108()
../../../../../../dist/include/xptcstubsdef.inc:107: error: prototype for 'nsresult nsXPTCStubBase::Stub109(PRUint64, PRUint64, PRUint64, PRUint64, PRUint64, PRUint64, PRUint64, PRUint64)' does not match any in class 'nsXPTCStubBase'
../../../../../../dist/include/xptcstubsdef.inc:107: error: candidate is: virtual nsresult nsXPTCStubBase::Stub109()
../../../../../../dist/include/xptcstubsdef.inc:108: error: prototype for 'nsresult nsXPTCStubBase::Stub110(PRUint64, PRUint64, PRUint64, PRUint64, PRUint64, PRUint64, PRUint64, PRUint64)' does not match any in class 'nsXPTCStubBase'
../../../../../../dist/include/xptcstubsdef.inc:108: error: candidate is: virtual nsresult nsXPTCStubBase::Stub110()
../../../../../../dist/include/xptcstubsdef.inc:109: error: prototype for 'nsresult nsXPTCStubBase::Stub111(PRUint64, PRUint64, PRUint64, PRUint64, PRUint64, PRUint64, PRUint64, PRUint64)' does not match any in class 'nsXPTCStubBase'
../../../../../../dist/include/xptcstubsdef.inc:109: error: candidate is: virtual nsresult nsXPTCStubBase::Stub111()
../../../../../../dist/include/xptcstubsdef.inc:110: error: prototype for 'nsresult nsXPTCStubBase::Stub112(PRUint64, PRUint64, PRUint64, PRUint64, PRUint64, PRUint64, PRUint64, PRUint64)' does not match any in class 'nsXPTCStubBase'
../../../../../../dist/include/xptcstubsdef.inc:110: error: candidate is: virtual nsresult nsXPTCStubBase::Stub112()
../../../../../../dist/include/xptcstubsdef.inc:111: error: prototype for 'nsresult nsXPTCStubBase::Stub113(PRUint64, PRUint64, PRUint64, PRUint64, PRUint64, PRUint64, PRUint64, PRUint64)' does not match any in class 'nsXPTCStubBase'
../../../../../../dist/include/xptcstubsdef.inc:111: error: candidate is: virtual nsresult nsXPTCStubBase::Stub113()
../../../../../../dist/include/xptcstubsdef.inc:112: error: prototype for 'nsresult nsXPTCStubBase::Stub114(PRUint64, PRUint64, PRUint64, PRUint64, PRUint64, PRUint64, PRUint64, PRUint64)' does not match any in class 'nsXPTCStubBase'
../../../../../../dist/include/xptcstubsdef.inc:112: error: candidate is: virtual nsresult nsXPTCStubBase::Stub114()
../../../../../../dist/include/xptcstubsdef.inc:113: error: prototype for 'nsresult nsXPTCStubBase::Stub115(PRUint64, PRUint64, PRUint64, PRUint64, PRUint64, PRUint64, PRUint64, PRUint64)' does not match any in class 'nsXPTCStubBase'
../../../../../../dist/include/xptcstubsdef.inc:113: error: candidate is: virtual nsresult nsXPTCStubBase::Stub115()
../../../../../../dist/include/xptcstubsdef.inc:114: error: prototype for 'nsresult nsXPTCStubBase::Stub116(PRUint64, PRUint64, PRUint64, PRUint64, PRUint64, PRUint64, PRUint64, PRUint64)' does not match any in class 'nsXPTCStubBase'
../../../../../../dist/include/xptcstubsdef.inc:114: error: candidate is: virtual nsresult nsXPTCStubBase::Stub116()
../../../../../../dist/include/xptcstubsdef.inc:115: error: prototype for 'nsresult nsXPTCStubBase::Stub117(PRUint64, PRUint64, PRUint64, PRUint64, PRUint64, PRUint64, PRUint64, PRUint64)' does not match any in class 'nsXPTCStubBase'
../../../../../../dist/include/xptcstubsdef.inc:115: error: candidate is: virtual nsresult nsXPTCStubBase::Stub117()
../../../../../../dist/include/xptcstubsdef.inc:116: error: prototype for 'nsresult nsXPTCStubBase::Stub118(PRUint64, PRUint64, PRUint64, PRUint64, PRUint64, PRUint64, PRUint64, PRUint64)' does not match any in class 'nsXPTCStubBase'
../../../../../../dist/include/xptcstubsdef.inc:116: error: candidate is: virtual nsresult nsXPTCStubBase::Stub118()
../../../../../../dist/include/xptcstubsdef.inc:117: error: prototype for 'nsresult nsXPTCStubBase::Stub119(PRUint64, PRUint64, PRUint64, PRUint64, PRUint64, PRUint64, PRUint64, PRUint64)' does not match any in class 'nsXPTCStubBase'
../../../../../../dist/include/xptcstubsdef.inc:117: error: candidate is: virtual nsresult nsXPTCStubBase::Stub119()
../../../../../../dist/include/xptcstubsdef.inc:118: error: prototype for 'nsresult nsXPTCStubBase::Stub120(PRUint64, PRUint64, PRUint64, PRUint64, PRUint64, PRUint64, PRUint64, PRUint64)' does not match any in class 'nsXPTCStubBase'
../../../../../../dist/include/xptcstubsdef.inc:118: error: candidate is: virtual nsresult nsXPTCStubBase::Stub120()
../../../../../../dist/include/xptcstubsdef.inc:119: error: prototype for 'nsresult nsXPTCStubBase::Stub121(PRUint64, PRUint64, PRUint64, PRUint64, PRUint64, PRUint64, PRUint64, PRUint64)' does not match any in class 'nsXPTCStubBase'
../../../../../../dist/include/xptcstubsdef.inc:119: error: candidate is: virtual nsresult nsXPTCStubBase::Stub121()
../../../../../../dist/include/xptcstubsdef.inc:120: error: prototype for 'nsresult nsXPTCStubBase::Stub122(PRUint64, PRUint64, PRUint64, PRUint64, PRUint64, PRUint64, PRUint64, PRUint64)' does not match any in class 'nsXPTCStubBase'
../../../../../../dist/include/xptcstubsdef.inc:120: error: candidate is: virtual nsresult nsXPTCStubBase::Stub122()
../../../../../../dist/include/xptcstubsdef.inc:121: error: prototype for 'nsresult nsXPTCStubBase::Stub123(PRUint64, PRUint64, PRUint64, PRUint64, PRUint64, PRUint64, PRUint64, PRUint64)' does not match any in class 'nsXPTCStubBase'
../../../../../../dist/include/xptcstubsdef.inc:121: error: candidate is: virtual nsresult nsXPTCStubBase::Stub123()
../../../../../../dist/include/xptcstubsdef.inc:122: error: prototype for 'nsresult nsXPTCStubBase::Stub124(PRUint64, PRUint64, PRUint64, PRUint64, PRUint64, PRUint64, PRUint64, PRUint64)' does not match any in class 'nsXPTCStubBase'
../../../../../../dist/include/xptcstubsdef.inc:122: error: candidate is: virtual nsresult nsXPTCStubBase::Stub124()
../../../../../../dist/include/xptcstubsdef.inc:123: error: prototype for 'nsresult nsXPTCStubBase::Stub125(PRUint64, PRUint64, PRUint64, PRUint64, PRUint64, PRUint64, PRUint64, PRUint64)' does not match any in class 'nsXPTCStubBase'
../../../../../../dist/include/xptcstubsdef.inc:123: error: candidate is: virtual nsresult nsXPTCStubBase::Stub125()
../../../../../../dist/include/xptcstubsdef.inc:124: error: prototype for 'nsresult nsXPTCStubBase::Stub126(PRUint64, PRUint64, PRUint64, PRUint64, PRUint64, PRUint64, PRUint64, PRUint64)' does not match any in class 'nsXPTCStubBase'
../../../../../../dist/include/xptcstubsdef.inc:124: error: candidate is: virtual nsresult nsXPTCStubBase::Stub126()
../../../../../../dist/include/xptcstubsdef.inc:125: error: prototype for 'nsresult nsXPTCStubBase::Stub127(PRUint64, PRUint64, PRUint64, PRUint64, PRUint64, PRUint64, PRUint64, PRUint64)' does not match any in class 'nsXPTCStubBase'
../../../../../../dist/include/xptcstubsdef.inc:125: error: candidate is: virtual nsresult nsXPTCStubBase::Stub127()
../../../../../../dist/include/xptcstubsdef.inc:126: error: prototype for 'nsresult nsXPTCStubBase::Stub128(PRUint64, PRUint64, PRUint64, PRUint64, PRUint64, PRUint64, PRUint64, PRUint64)' does not match any in class 'nsXPTCStubBase'
../../../../../../dist/include/xptcstubsdef.inc:126: error: candidate is: virtual nsresult nsXPTCStubBase::Stub128()
../../../../../../dist/include/xptcstubsdef.inc:127: error: prototype for 'nsresult nsXPTCStubBase::Stub129(PRUint64, PRUint64, PRUint64, PRUint64, PRUint64, PRUint64, PRUint64, PRUint64)' does not match any in class 'nsXPTCStubBase'
../../../../../../dist/include/xptcstubsdef.inc:127: error: candidate is: virtual nsresult nsXPTCStubBase::Stub129()
../../../../../../dist/include/xptcstubsdef.inc:128: error: prototype for 'nsresult nsXPTCStubBase::Stub130(PRUint64, PRUint64, PRUint64, PRUint64, PRUint64, PRUint64, PRUint64, PRUint64)' does not match any in class 'nsXPTCStubBase'
../../../../../../dist/include/xptcstubsdef.inc:128: error: candidate is: virtual nsresult nsXPTCStubBase::Stub130()
../../../../../../dist/include/xptcstubsdef.inc:129: error: prototype for 'nsresult nsXPTCStubBase::Stub131(PRUint64, PRUint64, PRUint64, PRUint64, PRUint64, PRUint64, PRUint64, PRUint64)' does not match any in class 'nsXPTCStubBase'
../../../../../../dist/include/xptcstubsdef.inc:129: error: candidate is: virtual nsresult nsXPTCStubBase::Stub131()
../../../../../../dist/include/xptcstubsdef.inc:130: error: prototype for 'nsresult nsXPTCStubBase::Stub132(PRUint64, PRUint64, PRUint64, PRUint64, PRUint64, PRUint64, PRUint64, PRUint64)' does not match any in class 'nsXPTCStubBase'
../../../../../../dist/include/xptcstubsdef.inc:130: error: candidate is: virtual nsresult nsXPTCStubBase::Stub132()
../../../../../../dist/include/xptcstubsdef.inc:131: error: prototype for 'nsresult nsXPTCStubBase::Stub133(PRUint64, PRUint64, PRUint64, PRUint64, PRUint64, PRUint64, PRUint64, PRUint64)' does not match any in class 'nsXPTCStubBase'
../../../../../../dist/include/xptcstubsdef.inc:131: error: candidate is: virtual nsresult nsXPTCStubBase::Stub133()
../../../../../../dist/include/xptcstubsdef.inc:132: error: prototype for 'nsresult nsXPTCStubBase::Stub134(PRUint64, PRUint64, PRUint64, PRUint64, PRUint64, PRUint64, PRUint64, PRUint64)' does not match any in class 'nsXPTCStubBase'
../../../../../../dist/include/xptcstubsdef.inc:132: error: candidate is: virtual nsresult nsXPTCStubBase::Stub134()
../../../../../../dist/include/xptcstubsdef.inc:133: error: prototype for 'nsresult nsXPTCStubBase::Stub135(PRUint64, PRUint64, PRUint64, PRUint64, PRUint64, PRUint64, PRUint64, PRUint64)' does not match any in class 'nsXPTCStubBase'
../../../../../../dist/include/xptcstubsdef.inc:133: error: candidate is: virtual nsresult nsXPTCStubBase::Stub135()
../../../../../../dist/include/xptcstubsdef.inc:134: error: prototype for 'nsresult nsXPTCStubBase::Stub136(PRUint64, PRUint64, PRUint64, PRUint64, PRUint64, PRUint64, PRUint64, PRUint64)' does not match any in class 'nsXPTCStubBase'
../../../../../../dist/include/xptcstubsdef.inc:134: error: candidate is: virtual nsresult nsXPTCStubBase::Stub136()
../../../../../../dist/include/xptcstubsdef.inc:135: error: prototype for 'nsresult nsXPTCStubBase::Stub137(PRUint64, PRUint64, PRUint64, PRUint64, PRUint64, PRUint64, PRUint64, PRUint64)' does not match any in class 'nsXPTCStubBase'
../../../../../../dist/include/xptcstubsdef.inc:135: error: candidate is: virtual nsresult nsXPTCStubBase::Stub137()
../../../../../../dist/include/xptcstubsdef.inc:136: error: prototype for 'nsresult nsXPTCStubBase::Stub138(PRUint64, PRUint64, PRUint64, PRUint64, PRUint64, PRUint64, PRUint64, PRUint64)' does not match any in class 'nsXPTCStubBase'
../../../../../../dist/include/xptcstubsdef.inc:136: error: candidate is: virtual nsresult nsXPTCStubBase::Stub138()
../../../../../../dist/include/xptcstubsdef.inc:137: error: prototype for 'nsresult nsXPTCStubBase::Stub139(PRUint64, PRUint64, PRUint64, PRUint64, PRUint64, PRUint64, PRUint64, PRUint64)' does not match any in class 'nsXPTCStubBase'
../../../../../../dist/include/xptcstubsdef.inc:137: error: candidate is: virtual nsresult nsXPTCStubBase::Stub139()
../../../../../../dist/include/xptcstubsdef.inc:138: error: prototype for 'nsresult nsXPTCStubBase::Stub140(PRUint64, PRUint64, PRUint64, PRUint64, PRUint64, PRUint64, PRUint64, PRUint64)' does not match any in class 'nsXPTCStubBase'
../../../../../../dist/include/xptcstubsdef.inc:138: error: candidate is: virtual nsresult nsXPTCStubBase::Stub140()
../../../../../../dist/include/xptcstubsdef.inc:139: error: prototype for 'nsresult nsXPTCStubBase::Stub141(PRUint64, PRUint64, PRUint64, PRUint64, PRUint64, PRUint64, PRUint64, PRUint64)' does not match any in class 'nsXPTCStubBase'
../../../../../../dist/include/xptcstubsdef.inc:139: error: candidate is: virtual nsresult nsXPTCStubBase::Stub141()
../../../../../../dist/include/xptcstubsdef.inc:140: error: prototype for 'nsresult nsXPTCStubBase::Stub142(PRUint64, PRUint64, PRUint64, PRUint64, PRUint64, PRUint64, PRUint64, PRUint64)' does not match any in class 'nsXPTCStubBase'
../../../../../../dist/include/xptcstubsdef.inc:140: error: candidate is: virtual nsresult nsXPTCStubBase::Stub142()
../../../../../../dist/include/xptcstubsdef.inc:141: error: prototype for 'nsresult nsXPTCStubBase::Stub143(PRUint64, PRUint64, PRUint64, PRUint64, PRUint64, PRUint64, PRUint64, PRUint64)' does not match any in class 'nsXPTCStubBase'
../../../../../../dist/include/xptcstubsdef.inc:141: error: candidate is: virtual nsresult nsXPTCStubBase::Stub143()
../../../../../../dist/include/xptcstubsdef.inc:142: error: prototype for 'nsresult nsXPTCStubBase::Stub144(PRUint64, PRUint64, PRUint64, PRUint64, PRUint64, PRUint64, PRUint64, PRUint64)' does not match any in class 'nsXPTCStubBase'
../../../../../../dist/include/xptcstubsdef.inc:142: error: candidate is: virtual nsresult nsXPTCStubBase::Stub144()
../../../../../../dist/include/xptcstubsdef.inc:143: error: prototype for 'nsresult nsXPTCStubBase::Stub145(PRUint64, PRUint64, PRUint64, PRUint64, PRUint64, PRUint64, PRUint64, PRUint64)' does not match any in class 'nsXPTCStubBase'
../../../../../../dist/include/xptcstubsdef.inc:143: error: candidate is: virtual nsresult nsXPTCStubBase::Stub145()
../../../../../../dist/include/xptcstubsdef.inc:144: error: prototype for 'nsresult nsXPTCStubBase::Stub146(PRUint64, PRUint64, PRUint64, PRUint64, PRUint64, PRUint64, PRUint64, PRUint64)' does not match any in class 'nsXPTCStubBase'
../../../../../../dist/include/xptcstubsdef.inc:144: error: candidate is: virtual nsresult nsXPTCStubBase::Stub146()
../../../../../../dist/include/xptcstubsdef.inc:145: error: prototype for 'nsresult nsXPTCStubBase::Stub147(PRUint64, PRUint64, PRUint64, PRUint64, PRUint64, PRUint64, PRUint64, PRUint64)' does not match any in class 'nsXPTCStubBase'
../../../../../../dist/include/xptcstubsdef.inc:145: error: candidate is: virtual nsresult nsXPTCStubBase::Stub147()
../../../../../../dist/include/xptcstubsdef.inc:146: error: prototype for 'nsresult nsXPTCStubBase::Stub148(PRUint64, PRUint64, PRUint64, PRUint64, PRUint64, PRUint64, PRUint64, PRUint64)' does not match any in class 'nsXPTCStubBase'
../../../../../../dist/include/xptcstubsdef.inc:146: error: candidate is: virtual nsresult nsXPTCStubBase::Stub148()
../../../../../../dist/include/xptcstubsdef.inc:147: error: prototype for 'nsresult nsXPTCStubBase::Stub149(PRUint64, PRUint64, PRUint64, PRUint64, PRUint64, PRUint64, PRUint64, PRUint64)' does not match any in class 'nsXPTCStubBase'
../../../../../../dist/include/xptcstubsdef.inc:147: error: candidate is: virtual nsresult nsXPTCStubBase::Stub149()
../../../../../../dist/include/xptcstubsdef.inc:148: error: prototype for 'nsresult nsXPTCStubBase::Stub150(PRUint64, PRUint64, PRUint64, PRUint64, PRUint64, PRUint64, PRUint64, PRUint64)' does not match any in class 'nsXPTCStubBase'
../../../../../../dist/include/xptcstubsdef.inc:148: error: candidate is: virtual nsresult nsXPTCStubBase::Stub150()
../../../../../../dist/include/xptcstubsdef.inc:149: error: prototype for 'nsresult nsXPTCStubBase::Stub151(PRUint64, PRUint64, PRUint64, PRUint64, PRUint64, PRUint64, PRUint64, PRUint64)' does not match any in class 'nsXPTCStubBase'
../../../../../../dist/include/xptcstubsdef.inc:149: error: candidate is: virtual nsresult nsXPTCStubBase::Stub151()
../../../../../../dist/include/xptcstubsdef.inc:150: error: prototype for 'nsresult nsXPTCStubBase::Stub152(PRUint64, PRUint64, PRUint64, PRUint64, PRUint64, PRUint64, PRUint64, PRUint64)' does not match any in class 'nsXPTCStubBase'
../../../../../../dist/include/xptcstubsdef.inc:150: error: candidate is: virtual nsresult nsXPTCStubBase::Stub152()
../../../../../../dist/include/xptcstubsdef.inc:151: error: prototype for 'nsresult nsXPTCStubBase::Stub153(PRUint64, PRUint64, PRUint64, PRUint64, PRUint64, PRUint64, PRUint64, PRUint64)' does not match any in class 'nsXPTCStubBase'
../../../../../../dist/include/xptcstubsdef.inc:151: error: candidate is: virtual nsresult nsXPTCStubBase::Stub153()
../../../../../../dist/include/xptcstubsdef.inc:152: error: prototype for 'nsresult nsXPTCStubBase::Stub154(PRUint64, PRUint64, PRUint64, PRUint64, PRUint64, PRUint64, PRUint64, PRUint64)' does not match any in class 'nsXPTCStubBase'
../../../../../../dist/include/xptcstubsdef.inc:152: error: candidate is: virtual nsresult nsXPTCStubBase::Stub154()
../../../../../../dist/include/xptcstubsdef.inc:153: error: prototype for 'nsresult nsXPTCStubBase::Stub155(PRUint64, PRUint64, PRUint64, PRUint64, PRUint64, PRUint64, PRUint64, PRUint64)' does not match any in class 'nsXPTCStubBase'
../../../../../../dist/include/xptcstubsdef.inc:153: error: candidate is: virtual nsresult nsXPTCStubBase::Stub155()
../../../../../../dist/include/xptcstubsdef.inc:154: error: prototype for 'nsresult nsXPTCStubBase::Stub156(PRUint64, PRUint64, PRUint64, PRUint64, PRUint64, PRUint64, PRUint64, PRUint64)' does not match any in class 'nsXPTCStubBase'
../../../../../../dist/include/xptcstubsdef.inc:154: error: candidate is: virtual nsresult nsXPTCStubBase::Stub156()
../../../../../../dist/include/xptcstubsdef.inc:155: error: prototype for 'nsresult nsXPTCStubBase::Stub157(PRUint64, PRUint64, PRUint64, PRUint64, PRUint64, PRUint64, PRUint64, PRUint64)' does not match any in class 'nsXPTCStubBase'
../../../../../../dist/include/xptcstubsdef.inc:155: error: candidate is: virtual nsresult nsXPTCStubBase::Stub157()
../../../../../../dist/include/xptcstubsdef.inc:156: error: prototype for 'nsresult nsXPTCStubBase::Stub158(PRUint64, PRUint64, PRUint64, PRUint64, PRUint64, PRUint64, PRUint64, PRUint64)' does not match any in class 'nsXPTCStubBase'
../../../../../../dist/include/xptcstubsdef.inc:156: error: candidate is: virtual nsresult nsXPTCStubBase::Stub158()
../../../../../../dist/include/xptcstubsdef.inc:157: error: prototype for 'nsresult nsXPTCStubBase::Stub159(PRUint64, PRUint64, PRUint64, PRUint64, PRUint64, PRUint64, PRUint64, PRUint64)' does not match any in class 'nsXPTCStubBase'
../../../../../../dist/include/xptcstubsdef.inc:157: error: candidate is: virtual nsresult nsXPTCStubBase::Stub159()
../../../../../../dist/include/xptcstubsdef.inc:158: error: prototype for 'nsresult nsXPTCStubBase::Stub160(PRUint64, PRUint64, PRUint64, PRUint64, PRUint64, PRUint64, PRUint64, PRUint64)' does not match any in class 'nsXPTCStubBase'
../../../../../../dist/include/xptcstubsdef.inc:158: error: candidate is: virtual nsresult nsXPTCStubBase::Stub160()
../../../../../../dist/include/xptcstubsdef.inc:159: error: prototype for 'nsresult nsXPTCStubBase::Stub161(PRUint64, PRUint64, PRUint64, PRUint64, PRUint64, PRUint64, PRUint64, PRUint64)' does not match any in class 'nsXPTCStubBase'
../../../../../../dist/include/xptcstubsdef.inc:159: error: candidate is: virtual nsresult nsXPTCStubBase::Stub161()
../../../../../../dist/include/xptcstubsdef.inc:160: error: prototype for 'nsresult nsXPTCStubBase::Stub162(PRUint64, PRUint64, PRUint64, PRUint64, PRUint64, PRUint64, PRUint64, PRUint64)' does not match any in class 'nsXPTCStubBase'
../../../../../../dist/include/xptcstubsdef.inc:160: error: candidate is: virtual nsresult nsXPTCStubBase::Stub162()
../../../../../../dist/include/xptcstubsdef.inc:161: error: prototype for 'nsresult nsXPTCStubBase::Stub163(PRUint64, PRUint64, PRUint64, PRUint64, PRUint64, PRUint64, PRUint64, PRUint64)' does not match any in class 'nsXPTCStubBase'
../../../../../../dist/include/xptcstubsdef.inc:161: error: candidate is: virtual nsresult nsXPTCStubBase::Stub163()
../../../../../../dist/include/xptcstubsdef.inc:162: error: prototype for 'nsresult nsXPTCStubBase::Stub164(PRUint64, PRUint64, PRUint64, PRUint64, PRUint64, PRUint64, PRUint64, PRUint64)' does not match any in class 'nsXPTCStubBase'
../../../../../../dist/include/xptcstubsdef.inc:162: error: candidate is: virtual nsresult nsXPTCStubBase::Stub164()
../../../../../../dist/include/xptcstubsdef.inc:163: error: prototype for 'nsresult nsXPTCStubBase::Stub165(PRUint64, PRUint64, PRUint64, PRUint64, PRUint64, PRUint64, PRUint64, PRUint64)' does not match any in class 'nsXPTCStubBase'
../../../../../../dist/include/xptcstubsdef.inc:163: error: candidate is: virtual nsresult nsXPTCStubBase::Stub165()
../../../../../../dist/include/xptcstubsdef.inc:164: error: prototype for 'nsresult nsXPTCStubBase::Stub166(PRUint64, PRUint64, PRUint64, PRUint64, PRUint64, PRUint64, PRUint64, PRUint64)' does not match any in class 'nsXPTCStubBase'
../../../../../../dist/include/xptcstubsdef.inc:164: error: candidate is: virtual nsresult nsXPTCStubBase::Stub166()
../../../../../../dist/include/xptcstubsdef.inc:165: error: prototype for 'nsresult nsXPTCStubBase::Stub167(PRUint64, PRUint64, PRUint64, PRUint64, PRUint64, PRUint64, PRUint64, PRUint64)' does not match any in class 'nsXPTCStubBase'
../../../../../../dist/include/xptcstubsdef.inc:165: error: candidate is: virtual nsresult nsXPTCStubBase::Stub167()
../../../../../../dist/include/xptcstubsdef.inc:166: error: prototype for 'nsresult nsXPTCStubBase::Stub168(PRUint64, PRUint64, PRUint64, PRUint64, PRUint64, PRUint64, PRUint64, PRUint64)' does not match any in class 'nsXPTCStubBase'
../../../../../../dist/include/xptcstubsdef.inc:166: error: candidate is: virtual nsresult nsXPTCStubBase::Stub168()
../../../../../../dist/include/xptcstubsdef.inc:167: error: prototype for 'nsresult nsXPTCStubBase::Stub169(PRUint64, PRUint64, PRUint64, PRUint64, PRUint64, PRUint64, PRUint64, PRUint64)' does not match any in class 'nsXPTCStubBase'
../../../../../../dist/include/xptcstubsdef.inc:167: error: candidate is: virtual nsresult nsXPTCStubBase::Stub169()
../../../../../../dist/include/xptcstubsdef.inc:168: error: prototype for 'nsresult nsXPTCStubBase::Stub170(PRUint64, PRUint64, PRUint64, PRUint64, PRUint64, PRUint64, PRUint64, PRUint64)' does not match any in class 'nsXPTCStubBase'
../../../../../../dist/include/xptcstubsdef.inc:168: error: candidate is: virtual nsresult nsXPTCStubBase::Stub170()
../../../../../../dist/include/xptcstubsdef.inc:169: error: prototype for 'nsresult nsXPTCStubBase::Stub171(PRUint64, PRUint64, PRUint64, PRUint64, PRUint64, PRUint64, PRUint64, PRUint64)' does not match any in class 'nsXPTCStubBase'
../../../../../../dist/include/xptcstubsdef.inc:169: error: candidate is: virtual nsresult nsXPTCStubBase::Stub171()
../../../../../../dist/include/xptcstubsdef.inc:170: error: prototype for 'nsresult nsXPTCStubBase::Stub172(PRUint64, PRUint64, PRUint64, PRUint64, PRUint64, PRUint64, PRUint64, PRUint64)' does not match any in class 'nsXPTCStubBase'
../../../../../../dist/include/xptcstubsdef.inc:170: error: candidate is: virtual nsresult nsXPTCStubBase::Stub172()
../../../../../../dist/include/xptcstubsdef.inc:171: error: prototype for 'nsresult nsXPTCStubBase::Stub173(PRUint64, PRUint64, PRUint64, PRUint64, PRUint64, PRUint64, PRUint64, PRUint64)' does not match any in class 'nsXPTCStubBase'
../../../../../../dist/include/xptcstubsdef.inc:171: error: candidate is: virtual nsresult nsXPTCStubBase::Stub173()
../../../../../../dist/include/xptcstubsdef.inc:172: error: prototype for 'nsresult nsXPTCStubBase::Stub174(PRUint64, PRUint64, PRUint64, PRUint64, PRUint64, PRUint64, PRUint64, PRUint64)' does not match any in class 'nsXPTCStubBase'
../../../../../../dist/include/xptcstubsdef.inc:172: error: candidate is: virtual nsresult nsXPTCStubBase::Stub174()
../../../../../../dist/include/xptcstubsdef.inc:173: error: prototype for 'nsresult nsXPTCStubBase::Stub175(PRUint64, PRUint64, PRUint64, PRUint64, PRUint64, PRUint64, PRUint64, PRUint64)' does not match any in class 'nsXPTCStubBase'
../../../../../../dist/include/xptcstubsdef.inc:173: error: candidate is: virtual nsresult nsXPTCStubBase::Stub175()
../../../../../../dist/include/xptcstubsdef.inc:174: error: prototype for 'nsresult nsXPTCStubBase::Stub176(PRUint64, PRUint64, PRUint64, PRUint64, PRUint64, PRUint64, PRUint64, PRUint64)' does not match any in class 'nsXPTCStubBase'
../../../../../../dist/include/xptcstubsdef.inc:174: error: candidate is: virtual nsresult nsXPTCStubBase::Stub176()
../../../../../../dist/include/xptcstubsdef.inc:175: error: prototype for 'nsresult nsXPTCStubBase::Stub177(PRUint64, PRUint64, PRUint64, PRUint64, PRUint64, PRUint64, PRUint64, PRUint64)' does not match any in class 'nsXPTCStubBase'
../../../../../../dist/include/xptcstubsdef.inc:175: error: candidate is: virtual nsresult nsXPTCStubBase::Stub177()
../../../../../../dist/include/xptcstubsdef.inc:176: error: prototype for 'nsresult nsXPTCStubBase::Stub178(PRUint64, PRUint64, PRUint64, PRUint64, PRUint64, PRUint64, PRUint64, PRUint64)' does not match any in class 'nsXPTCStubBase'
../../../../../../dist/include/xptcstubsdef.inc:176: error: candidate is: virtual nsresult nsXPTCStubBase::Stub178()
../../../../../../dist/include/xptcstubsdef.inc:177: error: prototype for 'nsresult nsXPTCStubBase::Stub179(PRUint64, PRUint64, PRUint64, PRUint64, PRUint64, PRUint64, PRUint64, PRUint64)' does not match any in class 'nsXPTCStubBase'
../../../../../../dist/include/xptcstubsdef.inc:177: error: candidate is: virtual nsresult nsXPTCStubBase::Stub179()
../../../../../../dist/include/xptcstubsdef.inc:178: error: prototype for 'nsresult nsXPTCStubBase::Stub180(PRUint64, PRUint64, PRUint64, PRUint64, PRUint64, PRUint64, PRUint64, PRUint64)' does not match any in class 'nsXPTCStubBase'
../../../../../../dist/include/xptcstubsdef.inc:178: error: candidate is: virtual nsresult nsXPTCStubBase::Stub180()
../../../../../../dist/include/xptcstubsdef.inc:179: error: prototype for 'nsresult nsXPTCStubBase::Stub181(PRUint64, PRUint64, PRUint64, PRUint64, PRUint64, PRUint64, PRUint64, PRUint64)' does not match any in class 'nsXPTCStubBase'
../../../../../../dist/include/xptcstubsdef.inc:179: error: candidate is: virtual nsresult nsXPTCStubBase::Stub181()
../../../../../../dist/include/xptcstubsdef.inc:180: error: prototype for 'nsresult nsXPTCStubBase::Stub182(PRUint64, PRUint64, PRUint64, PRUint64, PRUint64, PRUint64, PRUint64, PRUint64)' does not match any in class 'nsXPTCStubBase'
../../../../../../dist/include/xptcstubsdef.inc:180: error: candidate is: virtual nsresult nsXPTCStubBase::Stub182()
../../../../../../dist/include/xptcstubsdef.inc:181: error: prototype for 'nsresult nsXPTCStubBase::Stub183(PRUint64, PRUint64, PRUint64, PRUint64, PRUint64, PRUint64, PRUint64, PRUint64)' does not match any in class 'nsXPTCStubBase'
../../../../../../dist/include/xptcstubsdef.inc:181: error: candidate is: virtual nsresult nsXPTCStubBase::Stub183()
../../../../../../dist/include/xptcstubsdef.inc:182: error: prototype for 'nsresult nsXPTCStubBase::Stub184(PRUint64, PRUint64, PRUint64, PRUint64, PRUint64, PRUint64, PRUint64, PRUint64)' does not match any in class 'nsXPTCStubBase'
../../../../../../dist/include/xptcstubsdef.inc:182: error: candidate is: virtual nsresult nsXPTCStubBase::Stub184()
../../../../../../dist/include/xptcstubsdef.inc:183: error: prototype for 'nsresult nsXPTCStubBase::Stub185(PRUint64, PRUint64, PRUint64, PRUint64, PRUint64, PRUint64, PRUint64, PRUint64)' does not match any in class 'nsXPTCStubBase'
../../../../../../dist/include/xptcstubsdef.inc:183: error: candidate is: virtual nsresult nsXPTCStubBase::Stub185()
../../../../../../dist/include/xptcstubsdef.inc:184: error: prototype for 'nsresult nsXPTCStubBase::Stub186(PRUint64, PRUint64, PRUint64, PRUint64, PRUint64, PRUint64, PRUint64, PRUint64)' does not match any in class 'nsXPTCStubBase'
../../../../../../dist/include/xptcstubsdef.inc:184: error: candidate is: virtual nsresult nsXPTCStubBase::Stub186()
../../../../../../dist/include/xptcstubsdef.inc:185: error: prototype for 'nsresult nsXPTCStubBase::Stub187(PRUint64, PRUint64, PRUint64, PRUint64, PRUint64, PRUint64, PRUint64, PRUint64)' does not match any in class 'nsXPTCStubBase'
../../../../../../dist/include/xptcstubsdef.inc:185: error: candidate is: virtual nsresult nsXPTCStubBase::Stub187()
../../../../../../dist/include/xptcstubsdef.inc:186: error: prototype for 'nsresult nsXPTCStubBase::Stub188(PRUint64, PRUint64, PRUint64, PRUint64, PRUint64, PRUint64, PRUint64, PRUint64)' does not match any in class 'nsXPTCStubBase'
../../../../../../dist/include/xptcstubsdef.inc:186: error: candidate is: virtual nsresult nsXPTCStubBase::Stub188()
../../../../../../dist/include/xptcstubsdef.inc:187: error: prototype for 'nsresult nsXPTCStubBase::Stub189(PRUint64, PRUint64, PRUint64, PRUint64, PRUint64, PRUint64, PRUint64, PRUint64)' does not match any in class 'nsXPTCStubBase'
../../../../../../dist/include/xptcstubsdef.inc:187: error: candidate is: virtual nsresult nsXPTCStubBase::Stub189()
../../../../../../dist/include/xptcstubsdef.inc:188: error: prototype for 'nsresult nsXPTCStubBase::Stub190(PRUint64, PRUint64, PRUint64, PRUint64, PRUint64, PRUint64, PRUint64, PRUint64)' does not match any in class 'nsXPTCStubBase'
../../../../../../dist/include/xptcstubsdef.inc:188: error: candidate is: virtual nsresult nsXPTCStubBase::Stub190()
../../../../../../dist/include/xptcstubsdef.inc:189: error: prototype for 'nsresult nsXPTCStubBase::Stub191(PRUint64, PRUint64, PRUint64, PRUint64, PRUint64, PRUint64, PRUint64, PRUint64)' does not match any in class 'nsXPTCStubBase'
../../../../../../dist/include/xptcstubsdef.inc:189: error: candidate is: virtual nsresult nsXPTCStubBase::Stub191()
../../../../../../dist/include/xptcstubsdef.inc:190: error: prototype for 'nsresult nsXPTCStubBase::Stub192(PRUint64, PRUint64, PRUint64, PRUint64, PRUint64, PRUint64, PRUint64, PRUint64)' does not match any in class 'nsXPTCStubBase'
../../../../../../dist/include/xptcstubsdef.inc:190: error: candidate is: virtual nsresult nsXPTCStubBase::Stub192()
../../../../../../dist/include/xptcstubsdef.inc:191: error: prototype for 'nsresult nsXPTCStubBase::Stub193(PRUint64, PRUint64, PRUint64, PRUint64, PRUint64, PRUint64, PRUint64, PRUint64)' does not match any in class 'nsXPTCStubBase'
../../../../../../dist/include/xptcstubsdef.inc:191: error: candidate is: virtual nsresult nsXPTCStubBase::Stub193()
../../../../../../dist/include/xptcstubsdef.inc:192: error: prototype for 'nsresult nsXPTCStubBase::Stub194(PRUint64, PRUint64, PRUint64, PRUint64, PRUint64, PRUint64, PRUint64, PRUint64)' does not match any in class 'nsXPTCStubBase'
../../../../../../dist/include/xptcstubsdef.inc:192: error: candidate is: virtual nsresult nsXPTCStubBase::Stub194()
../../../../../../dist/include/xptcstubsdef.inc:193: error: prototype for 'nsresult nsXPTCStubBase::Stub195(PRUint64, PRUint64, PRUint64, PRUint64, PRUint64, PRUint64, PRUint64, PRUint64)' does not match any in class 'nsXPTCStubBase'
../../../../../../dist/include/xptcstubsdef.inc:193: error: candidate is: virtual nsresult nsXPTCStubBase::Stub195()
../../../../../../dist/include/xptcstubsdef.inc:194: error: prototype for 'nsresult nsXPTCStubBase::Stub196(PRUint64, PRUint64, PRUint64, PRUint64, PRUint64, PRUint64, PRUint64, PRUint64)' does not match any in class 'nsXPTCStubBase'
../../../../../../dist/include/xptcstubsdef.inc:194: error: candidate is: virtual nsresult nsXPTCStubBase::Stub196()
../../../../../../dist/include/xptcstubsdef.inc:195: error: prototype for 'nsresult nsXPTCStubBase::Stub197(PRUint64, PRUint64, PRUint64, PRUint64, PRUint64, PRUint64, PRUint64, PRUint64)' does not match any in class 'nsXPTCStubBase'
../../../../../../dist/include/xptcstubsdef.inc:195: error: candidate is: virtual nsresult nsXPTCStubBase::Stub197()
../../../../../../dist/include/xptcstubsdef.inc:196: error: prototype for 'nsresult nsXPTCStubBase::Stub198(PRUint64, PRUint64, PRUint64, PRUint64, PRUint64, PRUint64, PRUint64, PRUint64)' does not match any in class 'nsXPTCStubBase'
../../../../../../dist/include/xptcstubsdef.inc:196: error: candidate is: virtual nsresult nsXPTCStubBase::Stub198()
../../../../../../dist/include/xptcstubsdef.inc:197: error: prototype for 'nsresult nsXPTCStubBase::Stub199(PRUint64, PRUint64, PRUint64, PRUint64, PRUint64, PRUint64, PRUint64, PRUint64)' does not match any in class 'nsXPTCStubBase'
../../../../../../dist/include/xptcstubsdef.inc:197: error: candidate is: virtual nsresult nsXPTCStubBase::Stub199()
../../../../../../dist/include/xptcstubsdef.inc:198: error: prototype for 'nsresult nsXPTCStubBase::Stub200(PRUint64, PRUint64, PRUint64, PRUint64, PRUint64, PRUint64, PRUint64, PRUint64)' does not match any in class 'nsXPTCStubBase'
../../../../../../dist/include/xptcstubsdef.inc:198: error: candidate is: virtual nsresult nsXPTCStubBase::Stub200()
../../../../../../dist/include/xptcstubsdef.inc:199: error: prototype for 'nsresult nsXPTCStubBase::Stub201(PRUint64, PRUint64, PRUint64, PRUint64, PRUint64, PRUint64, PRUint64, PRUint64)' does not match any in class 'nsXPTCStubBase'
../../../../../../dist/include/xptcstubsdef.inc:199: error: candidate is: virtual nsresult nsXPTCStubBase::Stub201()
../../../../../../dist/include/xptcstubsdef.inc:200: error: prototype for 'nsresult nsXPTCStubBase::Stub202(PRUint64, PRUint64, PRUint64, PRUint64, PRUint64, PRUint64, PRUint64, PRUint64)' does not match any in class 'nsXPTCStubBase'
../../../../../../dist/include/xptcstubsdef.inc:200: error: candidate is: virtual nsresult nsXPTCStubBase::Stub202()
../../../../../../dist/include/xptcstubsdef.inc:201: error: prototype for 'nsresult nsXPTCStubBase::Stub203(PRUint64, PRUint64, PRUint64, PRUint64, PRUint64, PRUint64, PRUint64, PRUint64)' does not match any in class 'nsXPTCStubBase'
../../../../../../dist/include/xptcstubsdef.inc:201: error: candidate is: virtual nsresult nsXPTCStubBase::Stub203()
../../../../../../dist/include/xptcstubsdef.inc:202: error: prototype for 'nsresult nsXPTCStubBase::Stub204(PRUint64, PRUint64, PRUint64, PRUint64, PRUint64, PRUint64, PRUint64, PRUint64)' does not match any in class 'nsXPTCStubBase'
../../../../../../dist/include/xptcstubsdef.inc:202: error: candidate is: virtual nsresult nsXPTCStubBase::Stub204()
../../../../../../dist/include/xptcstubsdef.inc:203: error: prototype for 'nsresult nsXPTCStubBase::Stub205(PRUint64, PRUint64, PRUint64, PRUint64, PRUint64, PRUint64, PRUint64, PRUint64)' does not match any in class 'nsXPTCStubBase'
../../../../../../dist/include/xptcstubsdef.inc:203: error: candidate is: virtual nsresult nsXPTCStubBase::Stub205()
../../../../../../dist/include/xptcstubsdef.inc:204: error: prototype for 'nsresult nsXPTCStubBase::Stub206(PRUint64, PRUint64, PRUint64, PRUint64, PRUint64, PRUint64, PRUint64, PRUint64)' does not match any in class 'nsXPTCStubBase'
../../../../../../dist/include/xptcstubsdef.inc:204: error: candidate is: virtual nsresult nsXPTCStubBase::Stub206()
../../../../../../dist/include/xptcstubsdef.inc:205: error: prototype for 'nsresult nsXPTCStubBase::Stub207(PRUint64, PRUint64, PRUint64, PRUint64, PRUint64, PRUint64, PRUint64, PRUint64)' does not match any in class 'nsXPTCStubBase'
../../../../../../dist/include/xptcstubsdef.inc:205: error: candidate is: virtual nsresult nsXPTCStubBase::Stub207()
../../../../../../dist/include/xptcstubsdef.inc:206: error: prototype for 'nsresult nsXPTCStubBase::Stub208(PRUint64, PRUint64, PRUint64, PRUint64, PRUint64, PRUint64, PRUint64, PRUint64)' does not match any in class 'nsXPTCStubBase'
../../../../../../dist/include/xptcstubsdef.inc:206: error: candidate is: virtual nsresult nsXPTCStubBase::Stub208()
../../../../../../dist/include/xptcstubsdef.inc:207: error: prototype for 'nsresult nsXPTCStubBase::Stub209(PRUint64, PRUint64, PRUint64, PRUint64, PRUint64, PRUint64, PRUint64, PRUint64)' does not match any in class 'nsXPTCStubBase'
../../../../../../dist/include/xptcstubsdef.inc:207: error: candidate is: virtual nsresult nsXPTCStubBase::Stub209()
../../../../../../dist/include/xptcstubsdef.inc:208: error: prototype for 'nsresult nsXPTCStubBase::Stub210(PRUint64, PRUint64, PRUint64, PRUint64, PRUint64, PRUint64, PRUint64, PRUint64)' does not match any in class 'nsXPTCStubBase'
../../../../../../dist/include/xptcstubsdef.inc:208: error: candidate is: virtual nsresult nsXPTCStubBase::Stub210()
../../../../../../dist/include/xptcstubsdef.inc:209: error: prototype for 'nsresult nsXPTCStubBase::Stub211(PRUint64, PRUint64, PRUint64, PRUint64, PRUint64, PRUint64, PRUint64, PRUint64)' does not match any in class 'nsXPTCStubBase'
../../../../../../dist/include/xptcstubsdef.inc:209: error: candidate is: virtual nsresult nsXPTCStubBase::Stub211()
../../../../../../dist/include/xptcstubsdef.inc:210: error: prototype for 'nsresult nsXPTCStubBase::Stub212(PRUint64, PRUint64, PRUint64, PRUint64, PRUint64, PRUint64, PRUint64, PRUint64)' does not match any in class 'nsXPTCStubBase'
../../../../../../dist/include/xptcstubsdef.inc:210: error: candidate is: virtual nsresult nsXPTCStubBase::Stub212()
../../../../../../dist/include/xptcstubsdef.inc:211: error: prototype for 'nsresult nsXPTCStubBase::Stub213(PRUint64, PRUint64, PRUint64, PRUint64, PRUint64, PRUint64, PRUint64, PRUint64)' does not match any in class 'nsXPTCStubBase'
../../../../../../dist/include/xptcstubsdef.inc:211: error: candidate is: virtual nsresult nsXPTCStubBase::Stub213()
../../../../../../dist/include/xptcstubsdef.inc:212: error: prototype for 'nsresult nsXPTCStubBase::Stub214(PRUint64, PRUint64, PRUint64, PRUint64, PRUint64, PRUint64, PRUint64, PRUint64)' does not match any in class 'nsXPTCStubBase'
../../../../../../dist/include/xptcstubsdef.inc:212: error: candidate is: virtual nsresult nsXPTCStubBase::Stub214()
../../../../../../dist/include/xptcstubsdef.inc:213: error: prototype for 'nsresult nsXPTCStubBase::Stub215(PRUint64, PRUint64, PRUint64, PRUint64, PRUint64, PRUint64, PRUint64, PRUint64)' does not match any in class 'nsXPTCStubBase'
../../../../../../dist/include/xptcstubsdef.inc:213: error: candidate is: virtual nsresult nsXPTCStubBase::Stub215()
../../../../../../dist/include/xptcstubsdef.inc:214: error: prototype for 'nsresult nsXPTCStubBase::Stub216(PRUint64, PRUint64, PRUint64, PRUint64, PRUint64, PRUint64, PRUint64, PRUint64)' does not match any in class 'nsXPTCStubBase'
../../../../../../dist/include/xptcstubsdef.inc:214: error: candidate is: virtual nsresult nsXPTCStubBase::Stub216()
../../../../../../dist/include/xptcstubsdef.inc:215: error: prototype for 'nsresult nsXPTCStubBase::Stub217(PRUint64, PRUint64, PRUint64, PRUint64, PRUint64, PRUint64, PRUint64, PRUint64)' does not match any in class 'nsXPTCStubBase'
../../../../../../dist/include/xptcstubsdef.inc:215: error: candidate is: virtual nsresult nsXPTCStubBase::Stub217()
../../../../../../dist/include/xptcstubsdef.inc:216: error: prototype for 'nsresult nsXPTCStubBase::Stub218(PRUint64, PRUint64, PRUint64, PRUint64, PRUint64, PRUint64, PRUint64, PRUint64)' does not match any in class 'nsXPTCStubBase'
../../../../../../dist/include/xptcstubsdef.inc:216: error: candidate is: virtual nsresult nsXPTCStubBase::Stub218()
../../../../../../dist/include/xptcstubsdef.inc:217: error: prototype for 'nsresult nsXPTCStubBase::Stub219(PRUint64, PRUint64, PRUint64, PRUint64, PRUint64, PRUint64, PRUint64, PRUint64)' does not match any in class 'nsXPTCStubBase'
../../../../../../dist/include/xptcstubsdef.inc:217: error: candidate is: virtual nsresult nsXPTCStubBase::Stub219()
../../../../../../dist/include/xptcstubsdef.inc:218: error: prototype for 'nsresult nsXPTCStubBase::Stub220(PRUint64, PRUint64, PRUint64, PRUint64, PRUint64, PRUint64, PRUint64, PRUint64)' does not match any in class 'nsXPTCStubBase'
../../../../../../dist/include/xptcstubsdef.inc:218: error: candidate is: virtual nsresult nsXPTCStubBase::Stub220()
../../../../../../dist/include/xptcstubsdef.inc:219: error: prototype for 'nsresult nsXPTCStubBase::Stub221(PRUint64, PRUint64, PRUint64, PRUint64, PRUint64, PRUint64, PRUint64, PRUint64)' does not match any in class 'nsXPTCStubBase'
../../../../../../dist/include/xptcstubsdef.inc:219: error: candidate is: virtual nsresult nsXPTCStubBase::Stub221()
../../../../../../dist/include/xptcstubsdef.inc:220: error: prototype for 'nsresult nsXPTCStubBase::Stub222(PRUint64, PRUint64, PRUint64, PRUint64, PRUint64, PRUint64, PRUint64, PRUint64)' does not match any in class 'nsXPTCStubBase'
../../../../../../dist/include/xptcstubsdef.inc:220: error: candidate is: virtual nsresult nsXPTCStubBase::Stub222()
../../../../../../dist/include/xptcstubsdef.inc:221: error: prototype for 'nsresult nsXPTCStubBase::Stub223(PRUint64, PRUint64, PRUint64, PRUint64, PRUint64, PRUint64, PRUint64, PRUint64)' does not match any in class 'nsXPTCStubBase'
../../../../../../dist/include/xptcstubsdef.inc:221: error: candidate is: virtual nsresult nsXPTCStubBase::Stub223()
../../../../../../dist/include/xptcstubsdef.inc:222: error: prototype for 'nsresult nsXPTCStubBase::Stub224(PRUint64, PRUint64, PRUint64, PRUint64, PRUint64, PRUint64, PRUint64, PRUint64)' does not match any in class 'nsXPTCStubBase'
../../../../../../dist/include/xptcstubsdef.inc:222: error: candidate is: virtual nsresult nsXPTCStubBase::Stub224()
../../../../../../dist/include/xptcstubsdef.inc:223: error: prototype for 'nsresult nsXPTCStubBase::Stub225(PRUint64, PRUint64, PRUint64, PRUint64, PRUint64, PRUint64, PRUint64, PRUint64)' does not match any in class 'nsXPTCStubBase'
../../../../../../dist/include/xptcstubsdef.inc:223: error: candidate is: virtual nsresult nsXPTCStubBase::Stub225()
../../../../../../dist/include/xptcstubsdef.inc:224: error: prototype for 'nsresult nsXPTCStubBase::Stub226(PRUint64, PRUint64, PRUint64, PRUint64, PRUint64, PRUint64, PRUint64, PRUint64)' does not match any in class 'nsXPTCStubBase'
../../../../../../dist/include/xptcstubsdef.inc:224: error: candidate is: virtual nsresult nsXPTCStubBase::Stub226()
../../../../../../dist/include/xptcstubsdef.inc:225: error: prototype for 'nsresult nsXPTCStubBase::Stub227(PRUint64, PRUint64, PRUint64, PRUint64, PRUint64, PRUint64, PRUint64, PRUint64)' does not match any in class 'nsXPTCStubBase'
../../../../../../dist/include/xptcstubsdef.inc:225: error: candidate is: virtual nsresult nsXPTCStubBase::Stub227()
../../../../../../dist/include/xptcstubsdef.inc:226: error: prototype for 'nsresult nsXPTCStubBase::Stub228(PRUint64, PRUint64, PRUint64, PRUint64, PRUint64, PRUint64, PRUint64, PRUint64)' does not match any in class 'nsXPTCStubBase'
../../../../../../dist/include/xptcstubsdef.inc:226: error: candidate is: virtual nsresult nsXPTCStubBase::Stub228()
../../../../../../dist/include/xptcstubsdef.inc:227: error: prototype for 'nsresult nsXPTCStubBase::Stub229(PRUint64, PRUint64, PRUint64, PRUint64, PRUint64, PRUint64, PRUint64, PRUint64)' does not match any in class 'nsXPTCStubBase'
../../../../../../dist/include/xptcstubsdef.inc:227: error: candidate is: virtual nsresult nsXPTCStubBase::Stub229()
../../../../../../dist/include/xptcstubsdef.inc:228: error: prototype for 'nsresult nsXPTCStubBase::Stub230(PRUint64, PRUint64, PRUint64, PRUint64, PRUint64, PRUint64, PRUint64, PRUint64)' does not match any in class 'nsXPTCStubBase'
../../../../../../dist/include/xptcstubsdef.inc:228: error: candidate is: virtual nsresult nsXPTCStubBase::Stub230()
../../../../../../dist/include/xptcstubsdef.inc:229: error: prototype for 'nsresult nsXPTCStubBase::Stub231(PRUint64, PRUint64, PRUint64, PRUint64, PRUint64, PRUint64, PRUint64, PRUint64)' does not match any in class 'nsXPTCStubBase'
../../../../../../dist/include/xptcstubsdef.inc:229: error: candidate is: virtual nsresult nsXPTCStubBase::Stub231()
../../../../../../dist/include/xptcstubsdef.inc:230: error: prototype for 'nsresult nsXPTCStubBase::Stub232(PRUint64, PRUint64, PRUint64, PRUint64, PRUint64, PRUint64, PRUint64, PRUint64)' does not match any in class 'nsXPTCStubBase'
../../../../../../dist/include/xptcstubsdef.inc:230: error: candidate is: virtual nsresult nsXPTCStubBase::Stub232()
../../../../../../dist/include/xptcstubsdef.inc:231: error: prototype for 'nsresult nsXPTCStubBase::Stub233(PRUint64, PRUint64, PRUint64, PRUint64, PRUint64, PRUint64, PRUint64, PRUint64)' does not match any in class 'nsXPTCStubBase'
../../../../../../dist/include/xptcstubsdef.inc:231: error: candidate is: virtual nsresult nsXPTCStubBase::Stub233()
../../../../../../dist/include/xptcstubsdef.inc:232: error: prototype for 'nsresult nsXPTCStubBase::Stub234(PRUint64, PRUint64, PRUint64, PRUint64, PRUint64, PRUint64, PRUint64, PRUint64)' does not match any in class 'nsXPTCStubBase'
../../../../../../dist/include/xptcstubsdef.inc:232: error: candidate is: virtual nsresult nsXPTCStubBase::Stub234()
../../../../../../dist/include/xptcstubsdef.inc:233: error: prototype for 'nsresult nsXPTCStubBase::Stub235(PRUint64, PRUint64, PRUint64, PRUint64, PRUint64, PRUint64, PRUint64, PRUint64)' does not match any in class 'nsXPTCStubBase'
../../../../../../dist/include/xptcstubsdef.inc:233: error: candidate is: virtual nsresult nsXPTCStubBase::Stub235()
../../../../../../dist/include/xptcstubsdef.inc:234: error: prototype for 'nsresult nsXPTCStubBase::Stub236(PRUint64, PRUint64, PRUint64, PRUint64, PRUint64, PRUint64, PRUint64, PRUint64)' does not match any in class 'nsXPTCStubBase'
../../../../../../dist/include/xptcstubsdef.inc:234: error: candidate is: virtual nsresult nsXPTCStubBase::Stub236()
../../../../../../dist/include/xptcstubsdef.inc:235: error: prototype for 'nsresult nsXPTCStubBase::Stub237(PRUint64, PRUint64, PRUint64, PRUint64, PRUint64, PRUint64, PRUint64, PRUint64)' does not match any in class 'nsXPTCStubBase'
../../../../../../dist/include/xptcstubsdef.inc:235: error: candidate is: virtual nsresult nsXPTCStubBase::Stub237()
../../../../../../dist/include/xptcstubsdef.inc:236: error: prototype for 'nsresult nsXPTCStubBase::Stub238(PRUint64, PRUint64, PRUint64, PRUint64, PRUint64, PRUint64, PRUint64, PRUint64)' does not match any in class 'nsXPTCStubBase'
../../../../../../dist/include/xptcstubsdef.inc:236: error: candidate is: virtual nsresult nsXPTCStubBase::Stub238()
../../../../../../dist/include/xptcstubsdef.inc:237: error: prototype for 'nsresult nsXPTCStubBase::Stub239(PRUint64, PRUint64, PRUint64, PRUint64, PRUint64, PRUint64, PRUint64, PRUint64)' does not match any in class 'nsXPTCStubBase'
../../../../../../dist/include/xptcstubsdef.inc:237: error: candidate is: virtual nsresult nsXPTCStubBase::Stub239()
../../../../../../dist/include/xptcstubsdef.inc:238: error: prototype for 'nsresult nsXPTCStubBase::Stub240(PRUint64, PRUint64, PRUint64, PRUint64, PRUint64, PRUint64, PRUint64, PRUint64)' does not match any in class 'nsXPTCStubBase'
../../../../../../dist/include/xptcstubsdef.inc:238: error: candidate is: virtual nsresult nsXPTCStubBase::Stub240()
../../../../../../dist/include/xptcstubsdef.inc:239: error: prototype for 'nsresult nsXPTCStubBase::Stub241(PRUint64, PRUint64, PRUint64, PRUint64, PRUint64, PRUint64, PRUint64, PRUint64)' does not match any in class 'nsXPTCStubBase'
../../../../../../dist/include/xptcstubsdef.inc:239: error: candidate is: virtual nsresult nsXPTCStubBase::Stub241()
../../../../../../dist/include/xptcstubsdef.inc:240: error: prototype for 'nsresult nsXPTCStubBase::Stub242(PRUint64, PRUint64, PRUint64, PRUint64, PRUint64, PRUint64, PRUint64, PRUint64)' does not match any in class 'nsXPTCStubBase'
../../../../../../dist/include/xptcstubsdef.inc:240: error: candidate is: virtual nsresult nsXPTCStubBase::Stub242()
../../../../../../dist/include/xptcstubsdef.inc:241: error: prototype for 'nsresult nsXPTCStubBase::Stub243(PRUint64, PRUint64, PRUint64, PRUint64, PRUint64, PRUint64, PRUint64, PRUint64)' does not match any in class 'nsXPTCStubBase'
../../../../../../dist/include/xptcstubsdef.inc:241: error: candidate is: virtual nsresult nsXPTCStubBase::Stub243()
../../../../../../dist/include/xptcstubsdef.inc:242: error: prototype for 'nsresult nsXPTCStubBase::Stub244(PRUint64, PRUint64, PRUint64, PRUint64, PRUint64, PRUint64, PRUint64, PRUint64)' does not match any in class 'nsXPTCStubBase'
../../../../../../dist/include/xptcstubsdef.inc:242: error: candidate is: virtual nsresult nsXPTCStubBase::Stub244()
../../../../../../dist/include/xptcstubsdef.inc:243: error: prototype for 'nsresult nsXPTCStubBase::Stub245(PRUint64, PRUint64, PRUint64, PRUint64, PRUint64, PRUint64, PRUint64, PRUint64)' does not match any in class 'nsXPTCStubBase'
../../../../../../dist/include/xptcstubsdef.inc:243: error: candidate is: virtual nsresult nsXPTCStubBase::Stub245()
../../../../../../dist/include/xptcstubsdef.inc:244: error: prototype for 'nsresult nsXPTCStubBase::Stub246(PRUint64, PRUint64, PRUint64, PRUint64, PRUint64, PRUint64, PRUint64, PRUint64)' does not match any in class 'nsXPTCStubBase'
../../../../../../dist/include/xptcstubsdef.inc:244: error: candidate is: virtual nsresult nsXPTCStubBase::Stub246()
../../../../../../dist/include/xptcstubsdef.inc:245: error: prototype for 'nsresult nsXPTCStubBase::Stub247(PRUint64, PRUint64, PRUint64, PRUint64, PRUint64, PRUint64, PRUint64, PRUint64)' does not match any in class 'nsXPTCStubBase'
../../../../../../dist/include/xptcstubsdef.inc:245: error: candidate is: virtual nsresult nsXPTCStubBase::Stub247()
../../../../../../dist/include/xptcstubsdef.inc:246: error: prototype for 'nsresult nsXPTCStubBase::Stub248(PRUint64, PRUint64, PRUint64, PRUint64, PRUint64, PRUint64, PRUint64, PRUint64)' does not match any in class 'nsXPTCStubBase'
../../../../../../dist/include/xptcstubsdef.inc:246: error: candidate is: virtual nsresult nsXPTCStubBase::Stub248()
../../../../../../dist/include/xptcstubsdef.inc:247: error: prototype for 'nsresult nsXPTCStubBase::Stub249(PRUint64, PRUint64, PRUint64, PRUint64, PRUint64, PRUint64, PRUint64, PRUint64)' does not match any in class 'nsXPTCStubBase'
../../../../../../dist/include/xptcstubsdef.inc:247: error: candidate is: virtual nsresult nsXPTCStubBase::Stub249()
gmake[8]: *** [xptcstubs_ipf64.o] Error 1
gmake[8]: Leaving directory `/usr/ports/www/libxul/work/mozilla-1.9.2/xpcom/reflect/xptcall/src/md/unix'
gmake[7]: *** [libs] Error 2
gmake[7]: Leaving directory `/usr/ports/www/libxul/work/mozilla-1.9.2/xpcom/reflect/xptcall/src/md'
gmake[6]: *** [libs] Error 2
gmake[6]: Leaving directory `/usr/ports/www/libxul/work/mozilla-1.9.2/xpcom/reflect/xptcall/src'
gmake[5]: *** [libs] Error 2
gmake[5]: Leaving directory `/usr/ports/www/libxul/work/mozilla-1.9.2/xpcom/reflect/xptcall'
gmake[4]: *** [libs] Error 2
gmake[4]: Leaving directory `/usr/ports/www/libxul/work/mozilla-1.9.2/xpcom/reflect'
gmake[3]: *** [libs] Error 2
gmake[3]: Leaving directory `/usr/ports/www/libxul/work/mozilla-1.9.2/xpcom'
gmake[2]: *** [libs_tier_xpcom] Error 2
gmake[2]: Leaving directory `/usr/ports/www/libxul/work/mozilla-1.9.2'
gmake[1]: *** [tier_xpcom] Error 2
gmake[1]: Leaving directory `/usr/ports/www/libxul/work/mozilla-1.9.2'
gmake: *** [default] Error 2
*** Error code 1

Stop in /usr/ports/www/libxul.
*** Error code 1

Stop in /usr/ports/www/libxul.

Script done on Mon Mar 19 09:34:38 2012

top

Valid XHTML 1.0! | Valid CSS!